{"text_format":"1","workbook":"xlsx","n_sheets":11,"sheets":["Deckblatt","Lager_Ri","Lager_Schwein","Koferm","Betrieb","Lager_Gefl.","Lager_Schaf","Hilfe","JNS-SN","Ergebnis","WD-Anfall"],"not_rendered":{"charts":0,"images":1,"macros":1,"external_links":0,"defined_names":29,"comments":5,"pivot_tables":0},"unopened":[],"bounds":{"document_bytes":16777216,"sheet_cells":100000,"rows_first":2000,"rows_last":500,"rows_between":2000,"halvings":0,"cell_chars":16384,"cell_head_chars":4096},"cells_cut":0,"cells_raw":0,"read":"whole","date_system":"1900"}

{"sheet":"Deckblatt","index":0,"n_rows":43,"n_cols":15,"rows_kept":43,"cut":false,"hidden":false,"merged":[[0,0,0,16],[14,1,14,3],[16,1,16,3],[18,1,18,3],[38,0,38,17],[20,1,20,3],[22,1,22,3],[14,4,14,16],[16,4,16,16],[18,4,18,16],[20,4,20,16],[22,4,22,16],[5,4,5,16],[7,4,7,16],[9,4,9,16],[24,4,24,15],[30,14,30,16],[32,14,32,16],[26,4,26,16],[28,14,28,16],[42,3,42,13]]}
["Ermittlung der Lagerkapazität für Wirtschaftsdünger"]
[null,null,null,null,null,null,null,"\"Lagerka\""]
[null,null,null,null,null,null,null,"Version \"2017-3.1\""]
[]
[]
["mitwirk. Unternehmen:",null,null,null,"LfULG"]
[]
["Bearbeiter:",null,null,null,"Administrator"]
[]
["Tel./email:"]
[]
[]
[null,"Allgemeine Angaben:"]
[]
[null,"Name des Betriebes:",null,null,"Testbetrieb"]
[]
[null,"Straße/Nummer:",null,null,"Hauptstr. 100"]
[]
[null,"PLZ/Ort:",null,null,"01234 Neudorf"]
[]
[null,"Tel./email:",null,null,"012345/6789"]
[]
[null,"Ansprechpartner:",null,null,"Herr Mustermann"]
[]
[null,"Unternehmensnummer:",null,null,141234567890]
[]
[null,"Name / Ort der Anlage:",null,null,"01234 Neudorf"]
[]
[null,"Berechnung im Rahmen der/des",null,null,null,null,null,null,null,null,null,null,null,null,"Test"]
[]
[null,"Datum der Berechnung",null,null,null,null,null,null,null,null,null,null,null,null,"2024-05-05"]
[]
[null,"Jahresniederschlag in mm",null,null,null,null,null,null,null,null,null,null,null,null,600]
[]
[]
[]
[]
[]
[]
[]
[]
[]
[null,null,null,"   Sächsisches Landesamt für Umwelt, Landwirtschaft und Geologie"]

{"sheet":"Lager_Ri","index":1,"n_rows":16378,"n_cols":20,"rows_kept":16378,"cut":false,"hidden":false,"merged":[[41,0,44,7],[1,6,1,7],[1,14,1,16],[4,15,4,16],[5,15,5,16],[6,15,6,16],[31,8,37,16]]}
["Flüssig- und Festmistanfall für Rinder",null,null,null,null,null,{"$f":"Deckblatt!H3","v":"Version \"2017-3.1\""},{"$f":"Deckblatt!O31","v":"2024-05-05"},"Silosickersaftanfall und -lagerkapazität",null,null,null,null,null,null,{"$f":"Deckblatt!H3","v":"Version \"2017-3.1\""},{"$f":"Deckblatt!O31","v":"2024-05-05"}]
["Betrieb:",{"$f":"Deckblatt!E15","v":"Testbetrieb"},null,null,null,"Untern.-Nr.:",{"$f":"Deckblatt!E25","v":141234567890},null,"Betrieb:",{"$f":"B2","v":"Testbetrieb"},null,null,null,"Untern.-Nr.:",{"$f":"G2","v":141234567890}]
["mitwirk.  Untern.:",{"$f":"Deckblatt!E6","v":"LfULG"},null,null,null,"Bearbeiter:",{"$f":"Deckblatt!E8","v":"Administrator"},null,"mitwirkendes Unternehmen:",{"$f":"Deckblatt!E6","v":"LfULG"},null,null,null,"Bearbeiter:",{"$f":"Deckblatt!E8","v":"Administrator"}]
[null,null,null,null,null,null,"Variante:",null,"Jahresniederschlag in mm","(langjähriges Mittel)",null,{"$f":"Deckblatt!O33","v":600},null,null,"Variante:",{"$f":"H4","v":0}]
["Produktions-","Tierplätze","Tierplätze","Tierplätze","Tierplätze","Tierplätze","Anfall in m³","Anfall in m³",null,"Silohöhe","Silofläche","Fläche der ","einmünd.","Niederschlag","Sickersaft-","anzurechn."]
["abschnitt","gesamt","Gülle","Tiefstreu mit","Tiefstreu ohne","Flachstreu","Gülle/Jauche","Festmist","Bezeichnung der Siloanlage",null," gesamt","größten Kammer","Flächen","Anfall für","behälter","Siloraum"]
[null,"darunter:",null,"sep. Fressber.","sep. Fressber.",null,1,{"$f":"Betrieb!A6","v":1},null,"in m","in m²"," in m²","in m²",1,"mind.   m³","in m³"]
["Milchkühe",null,null,null,null,null,{"$f":"((C8*(1.5+((((A10+4)*1000-4000)/1000)*(0.25/6))))+(D8*(1.5+((((A10+4)*1000-4000)/1000)*(0.25/6))))*0.55)*IF(C9=\"\",(G7+5),IF(C9/30>(G7+5),(G7+5),C9/30))","v":0},{"$f":"(F8*VLOOKUP(A10,B55:I64,3)*VLOOKUP(H7,A92:B97,2)+E8*VLOOKUP(A10,B55:I64,IF(H7<2,3,5))+D8*VLOOKUP(A10,B55:I64,IF(H7<2,3,5))*0.45)*(H7+1)","v":0},null,null,null,null,null,{"$f":"IF(K8>0,K8*$L$4*($N$7+2)*30/360*0.7/1000/2+M8*$L$4*($N$7+2)*30/360*0.7/1000,\"\")","v":""},{"$f":"IF(L8=0,0,IF(J8*L8*0.03>3,J8*L8*0.03,3))","v":0},null,{"$f":"L8*J8","v":0}]
[null,{"$f":"IF(C8+D8+E8+F8=B8,\"Tage Stall:\",(C8+D8+E8+F8-B8))","v":"Tage Stall:"},null,null,null,1,{"$f":"IF(F9=1,F8*VLOOKUP(A10,B55:I64,4)*IF(C9=\"\",(G7+5),IF(C9/30>(G7+5),(G7+5),C9/30)),F8*VLOOKUP(A10,B55:I64,4)*IF(C9=\"\",(G7+5)/2,IF(C9/30>(G7+5),(G7+5)/2,C9/30/2)))","v":0},null,null,null,null,null,null,"",{"$f":"IF(L9=0,0,IF(J9*L9*0.03>3,J9*L9*0.03,3))","v":0},null,{"$f":"L9*J9","v":0}]
[6,null,"Melkabwasser in Gülle einleiten ?",null,null,1,{"$f":"IF(F10=1,(C8+D8+E8+F8)*8.5*30/1000*(G7+5),0)","v":0},null,null,null,null,null,null,"",0,null,0]
["trag. Färsen",null,null,null,null,null,{"$f":"(C11*I66+D11*H66)*IF(C12=\"\",(G7+5),IF(C12/30>(G7+5),(G7+5),C12/30))","v":0},{"$f":"(D11*IF($H$7<2,D66*0.45,G66)+E11*IF($H$7<2,D66,F66)+F11*D66*VLOOKUP(H7,A92:B97,2))*($H$7+1)","v":0},null,null,null,null,null,"",0,null,0]
["über 2 Jahre",{"$f":"IF(C11+D11+E11+F11=B11,\"Tage Stall:\",(C11+D11+E11+F11-B11))","v":"Tage Stall:"},null,null,null,1,{"$f":"IF(F12=2,F11*E66/2,F11*E66)*IF(C12=\"\",(G7+5),IF(C12/30>(G7+5),(G7+5),C12/30))","v":0},null,null,null,null,null,null,"",{"$f":"IF(L12=0,0,IF(J12*L12*0.03>3,J12*L12*0.03,3))","v":0},null,0]
["Jungrinder ",null,null,null,null,null,{"$f":"(C13*I67+D13*H67)*IF(C14=\"\",(G7+5),IF(C14/30>(G7+5),(G7+5),C14/30))","v":0},{"$f":"(D13*IF($H$7<2,D67*0.45,G67)+E13*IF($H$7<2,D67,F67)+F13*D67*VLOOKUP(H7,A92:B97,2))*($H$7+1)","v":0},null,null,null,null,null,"",0,null,0]
["1 - 2 Jahre",{"$f":"IF(C13+D13+E13+F13=B13,\"Tage Stall:\",(C13+D13+E13+F13-B13))","v":"Tage Stall:"},null,null,null,1,{"$f":"IF(F14=2,F13*E67/2,F13*E67)*IF(C14=\"\",(G7+5),IF(C14/30>(G7+5),(G7+5),C14/30))","v":0},null,null,null,null,null,null,"",0,null,0]
["Jungrinder",null,null,null,null,null,{"$f":"(C15*I68+D15*H68)*IF(C16=\"\",(G7+5),IF(C16/30>(G7+5),(G7+5),C16/30))","v":0},{"$f":"(D15*IF($H$7<2,D68*0.45,G68)+E15*IF($H$7<2,D68,F68)+F15*D68*VLOOKUP(H7,A92:B97,2))*($H$7+1)","v":0},"Summe ",null,{"$f":"SUM(K8:K14)","v":0},null,null,{"$f":"SUM(N8:N14)","v":0},{"$f":"SUM(O8:O14)","v":0},null,{"$f":"SUM(Q8:Q14)","v":0}]
["> 6 Mon. - 1 Jahr",{"$f":"IF(C15+D15+E15+F15=B15,\"Tage Stall:\",(C15+D15+E15+F15-B15))","v":"Tage Stall:"},null,null,null,1,{"$f":"IF(F16=2,F15*E68/2,F15*E68)*IF(C16=\"\",(G7+5),IF(C16/30>(G7+5),(G7+5),C16/30))","v":0}]
["Kälber (o.Mastk.)",null,null,null,null,null,{"$f":"(C17*I69+D17*H69)*(G$7+5)","v":0},{"$f":"(D17*IF($H$7<2,D69*0.45,G69)+E17*IF($H$7<2,D69,F69)+F17*D69*VLOOKUP(H7,A92:B97,2))*($H$7+1)","v":0},"Name Lager","Anzahl","Behälter-","Art der","Untenentn.","Oberfläche","Grundfläche","Höhe","Lagerraum","Behälterh.","Trapez-"]
[" über 3 - 6 Monate",{"$f":"IF(C17+D17+E17+F17=B17,\"\",(C17+D17+E17+F17-B17))","v":""},null,null,null,null,{"$f":"F17*E69*(G$7+5)","v":0},null,"Sickersaftbehälter","Behälter","form","Abdeckung","o. Pumpens.","o. Durchmesser","in m²","in m","netto* in m³","verfügbar","behölter","Regenwasser"]
["Kälber (o.Mastk.)",null,null,null,null,null,{"$f":"(C19*I70+D19*H70)*(G7+5)","v":0},{"$f":"(D19*IF($H$7<2,D70*0.45,G70)+E19*IF($H$7<2,D70,F70)+F19*D70*VLOOKUP(H7,A92:B97,2))*($H$7+1)","v":0},null,null,1,1,2,null,null,null,{"$f":"J19*IF(K19=1,(N19/2)*(N19/2)*PI()*R19-T19,IF(K19=2,N19*R19-T19,S19-T19))","v":0},{"$f":"IF(P19=0,0,IF(M19=1,P19-0.2,P19-0.2-0.15))","v":0},{"$f":"IF(K19=3,(N19+O19+SQRT(N19*O19))*P19/3-IF(M19=1,N19*0.2,N19*0.2+O19*0.15),0)","v":0},{"$f":"IF(OR(L19=1,P19=\"\"),0,IF(K19=1,(N19/2)*(N19/2)*PI()*$L$4/1000*0.7*2*30/360,N19*$L$4/1000*0.7*2*30/360))","v":0}]
["bis 3 Monate",{"$f":"IF(C19+D19+E19+F19=B19,\"\",(C19+D19+E19+F19-B19))","v":""},null,null,null,null,{"$f":"F19*E70*(G7+5)","v":0},null,null,null,1,1,2,null,null,null,{"$f":"J20*IF(K20=1,(N20/2)*(N20/2)*PI()*R20-T20,IF(K20=2,N20*R20-T20,S20-T20))","v":0},{"$f":"IF(P20=0,0,IF(M20=1,P20-0.2,P20-0.2-0.15))","v":0},{"$f":"IF(K20=3,(N20+O20+SQRT(N20*O20))*P20/3-IF(M20=1,N20*0.2,N20*0.2+O20*0.15),0)","v":0},{"$f":"IF(OR(L20=1,P20=\"\"),0,IF(K20=1,(N20/2)*(N20/2)*PI()*$L$4/1000*0.7*2*30/360,N20*$L$4/1000*0.7*2*30/360))","v":0}]
["Mastrinder (Bullen)",null,null,null,null,null,{"$f":"(C21*I76+D21*H76)*(G7+5)","v":0},{"$f":"(D21*IF($H$7<2,D76*0.45,G76)+E21*IF($H$7<2,D76,F76)+F21*D76*VLOOKUP(H7,A92:B97,2))*($H$7+1)","v":0},null,null,1,1,2,null,null,null,0,0,0,0]
["> 2 Jahre",{"$f":"IF(C21+D21+E21+F21=B21,\"\",(C21+D21+E21+F21-B21))","v":""},null,null,null,1,{"$f":"IF(F22=2,F21*E76/2,F21*E76)*(G7+5)","v":0},null,null,null,1,1,2,null,null,null,0,0,0,0]
["Mastrinder",null,null,null,null,null,{"$f":"(C23*I75+D23*H75)*(G7+5)","v":0},{"$f":"(D23*IF($H$7<2,D75*0.45,G75)+E23*IF($H$7<2,D75,F75)+F23*D75*VLOOKUP(H7,A92:B97,2))*($H$7+1)","v":0},null,null,1,1,1,null,null,null,0,0,0,0]
["1-2 Jahre",{"$f":"IF(C23+D23+E23+F23=B23,\"\",(C23+D23+E23+F23-B23))","v":""},null,null,null,1,{"$f":"IF(F24=2,F23*E75/2,F23*E75)*(G7+5)","v":0},null,null,null,1,2,2,null,null,null,0,0,0,0]
["Mastrinder",null,null,null,null,null,{"$f":"(C25*I74+D25*H74)*(G7+5)","v":0},{"$f":"(D25*IF($H$7<2,D74*0.45,G74)+E25*IF($H$7<2,D74,F74)+F25*D74*VLOOKUP(H7,A92:B97,2))*($H$7+1)","v":0},null,null,1,2,2,null,null,null,0,0,0,0]
["6 Mon.- 1 Jahr",{"$f":"IF(C25+D25+E25+F25=B25,\"\",(C25+D25+E25+F25-B25))","v":""},null,null,null,1,{"$f":"IF(F26=2,F25*E74/2,F25*E74)*(G7+5)","v":0},null,"Summe ",{"$f":"SUM(J19:J25)","v":0},null,null,null,null,null,null,{"$f":"SUM(Q19:Q25)","v":0}]
["Mastkälber",null,null,null,null,null,{"$f":"(C27*I73+D27*H73)*(G7+5)/IF(C28=1,2,1)","v":0},{"$f":"(D27*IF($H$7<2,D73*0.45,G73)+E27*IF($H$7<2,D73,F73)+F27*D73*VLOOKUP(H7,A92:B97,2))*($H$7+1)","v":0}]
[" über 3 - 6 Monate",{"$f":"IF(C27+D27+E27+F27=B27,\"\",(C27+D27+E27+F27-B27))","v":""},2,null,null,1,{"$f":"IF(F28=2,F27*E73/2,F27*E73)*(G7+5)","v":0},null,"Die Lagerkapazität für Silosickersaft beträgt :",null,null,null,{"$f":"IF(Q15=0,\"\",Q26/Q15)","v":""},"des gleichzeitig befüllten Siloraumes"]
["Mastkälber ",null,null,null,null,null,{"$f":"(C29*I72+D29*H72)*(G7+5)/IF(C30=1,2,1)","v":0},{"$f":"(D29*IF($H$7<2,D72*0.45,G72)+E29*IF($H$7<2,D72,F72)+F29*D72*VLOOKUP(H7,A92:B97,2))*($H$7+1)","v":0},"dies entspricht :",null,null,null,{"$f":"IF(Q26>0,Q26/((N15+O15)/((N7+2)*30)),\"\")","v":""},"Tagen =",null,{"$f":"IF(M29=\"\",\"\",M29/30)","v":""},"Monaten"]
["bis 3 Monate",{"$f":"IF(C29+D29+E29+F29=B29,\"\",(C29+D29+E29+F29-B29))","v":""},2,null,null,null,{"$f":"F29*E72*(G7+5)","v":0}]
["Rosa-Kalbfleisch",null,null,null,null,null,{"$f":"(C31*I78+D31*H78)*(G$7+5)","v":0},{"$f":"(D31*IF($H$7<2,D78*0.45,G78)+E31*IF($H$7<2,D78,F78)+F31*D78*VLOOKUP(H7,A92:B97,2))*($H$7+1)","v":0},"Kommentar:"]
["50 - 350 kg",null,null,null,null,null,{"$f":"F31*E78*(G$7+5)","v":0}]
["Fresseraufzucht",null,null,null,null,null,{"$f":"(C33*I79+D33*H79)*(G$7+5)","v":0},{"$f":"(D33*IF($H$7<2,D79*0.45,G79)+E33*IF($H$7<2,D79,F79)+F33*D79*VLOOKUP(H7,A92:B97,2))*($H$7+1)","v":0}]
["80 - 210 kg",null,null,null,null,null,{"$f":"F33*E79*(G$7+5)","v":0}]
["Mutter-/Ammen- ",null,null,null,null,null,{"$f":"IF(B36=1,(C35*I81+D35*H81)*IF(E36=\"\",(G7+5),IF(E36/30>(G7+5),(G7+5),(E36/30))),(C35*I83+D35*H83)*IF(E36=\"\",(G7+5),IF(E36/30>(G7+5),(G7+5),(E36/30))))","v":0},{"$f":"IF(B36=1,(D35*IF(H7<2,D81*0.45,G81)+E35*IF(H7<2,D81,F81)+F35*D81*VLOOKUP(H7,A92:B97,2)),(D35*IF(H7<2,D83*0.45,G83)+E35*IF(H7<2,D83,F83)+F35*D83*VLOOKUP(H7,A92:B97,2)))*(H7+1)","v":0}]
["Kühe, 500 kg",2,"Anz. Tage Stallhaltung:",null,null,1,{"$f":"IF(B36=1,IF(F36=2,F35*E81/2,F35*E81),IF(F36=2,F35*E83/2,F35*E83))*IF(E36=\"\",(G7+5),IF(E36/30>(G7+5),(G7+5),(E36/30)))","v":0}]
["Mutter-/Ammen- ",null,null,null,null,null,{"$f":"IF(B38=1,(C37*I82+D37*H82)*IF(E38=\"\",(G7+5),IF(E38/30>(G7+5),(G7+5),(E38/30))),(C37*I84+D37*H84)*IF(E38=\"\",(G7+5),IF(E38/30>(G7+5),(G7+5),(E38/30))))","v":0},{"$f":"IF(B38=1,(D37*IF(H7<2,D82*0.45,G82)+E37*IF(H7<2,D82,F82)+F37*D82*VLOOKUP(H7,A92:B97,2)),(D37*IF(H7<2,D84*0.45,G84)+E37*IF(H7<2,D84,F84)+F37*D84*VLOOKUP(H7,A92:B97,2)))*(H7+1)","v":0}]
["Kühe, 700 kg",2,"Anz. Tage Stallhaltung:",null,null,2,{"$f":"IF(B38=1,IF(F38=2,F37*E82/2,F37*E82),IF(F38=2,F37*E84/2,F37*E84))*IF(E38=\"\",(G7+5),IF(E38/30>(G7+5),(G7+5),(E38/30)))","v":0}]
["alle Bereiche"," zusätzliches Reinigungswasser (Liter/Tag)",null,null,null,null,{"$f":"F39*30/1000*(G7+5)","v":0}]
["Summe Rinder",{"$f":"SUM(B37,B35,B29,B27,B25,B23,B21,B19,B17,B15,B13,B11,B8)","v":0},null,null,null,null,{"$f":"SUM(G8:G39)","v":0},{"$f":"SUM(H37,H35,H29,H27,H25,H23,H21,H19,H17,H15,H13,H11,H8)","v":0}]
["Kommentar:"]
[]
[]
[]
[]
[]
[]
[]
[]
[null,null,null,"Flachlauf-, ",null,"Tiefstreustall ","Tiefstreustall ",null,"Laufstall, "]
[null,null,null,null,null,"ohne sep.","mit sep. 55%",null,"Anbindestall "]
[null,null,null,"Anbindestall ",null,"Freßbereich","Freßbereich"]
["Rinder",null,"Frischmist","Frischmist"]
[null,null,"t/Tier","m³/Tier","Jauche","Dung","Dung","Gülle","Gülle"]
["Milchkuh 5000 Liter",1,1.1499999999999999,1.39,0.49,1.18,0.53,0.85,1.54]
["Milchkuh 6000 Liter",2,1.2,1.45,0.5,1.19,0.54,0.87,1.58]
["Milchkuh 7000 Liter",3,1.23,1.48,0.51,1.2,0.54,0.89,1.62]
["Milchkuh 8000 Liter",4,1.25,1.51,0.53,1.21,0.54,0.92,1.67]
["Milchkuh 9000 Liter",5,1.32,1.59,0.55000000000000004,1.22,0.55000000000000004,0.94,1.71]
["Milchkuh 10000 Liter",6,1.33,1.6,0.56999999999999995,1.23,0.55000000000000004,0.96,1.75]
["Milchkuh 11000 Liter",7,1.37,1.65,0.57999999999999996,1.24,0.56000000000000005,0.98,1.79]
["Milchkuh 12000 Liter",8,1.42,1.71,0.6,1.25,0.56000000000000005,1.01,1.84]
["Milchkuh 13000 Liter",9,1.46,1.76,0.62,1.26,0.56999999999999995,1.03,1.88]
["Milchkuh 14000 Liter",10,1.5,1.81,0.63,1.27,0.56999999999999995,1.06,1.92]
["Melkhausabwasser",null,null,null,null,null,null,null,0.255]
["Färsen über 2 Jahre",1,1.03,1.24,0.38,0.96,0.43,0.73,1.32]
["Jungrinder 1-2 Jahre",0.7,0.85,1.02,0.27,0.77,0.35,0.55000000000000004,1]
["Jungrinder >6 Monate-1Jahr",0.43,0.52,0.63,0.13,0.47,0.21,0.31,0.56000000000000005]
["Kälber 3-6 Monate",0.25,0.34,0.41,0.05,0.31,0.14000000000000001,0.19,0.35]
["Kälber 0-3 Monate",0.14000000000000001,0.26,0.31,0.03,0.23,0.1,0.12,0.21]
[]
["Mastkälber unter 3 Monaten",0.2,0.22,0.27,7.0000000000000007E-2,0.21,0.09,0.22,0.4]
["Mastkälber 3- 6 Monate",0.33,0.23,0.28000000000000003,0.11,0.22,0.1,0.27,0.5]
[" Männliche Rinder über 6 Monate bis 1 Jahr",0.6,0.38,0.46,0.24,0.4,0.18,0.35,0.63]
[" Männliche Rinder über 1 Jahr bis 2 Jahre",1,0.5,0.6,0.42,0.52,0.23,0.41,0.74]
[" Männliche Rinder über 2 Jahre (einschl. Zuchtbullen)",1.2,0.64,0.77,0.45,0.67,0.3,0.55000000000000004,1]
[]
["Rosa-Kalbfleisch",0.4,0.3,0.36,0.04,0.27,0.12,0.18,0.33]
["Fresseraufzucht",0.28999999999999998,0.38,0.46,0.04,0.35,0.16,0.25,0.46]
[]
[" Mutter- und Ammenkühe m.0,9 Kalb",null,1,1.2,0.46,1,0.45,0.73,1.33]
[" Mutter- und Ammenkühe m.0,9 Kalb",null,1.32,1.59,0.5,1.35,0.6,0.92,1.67]
[" Mutter- und Ammenkühe",1.2,0.73,0.88,0.42,0.74,0.33,0.62,1.1299999999999999]
[" Mutter- und Ammenkühe",1.2,1.05,1.27,0.46,1.1000000000000001,0.5,0.8,1.46]
[]
[null,"500 kg","Frischmist","ja",null,5000,"Rundbeh."]
[null,"700 kg","Tiefstreu","nein","2 Monate",6000,"Rechteckbeh."]
[null,null,null,null,"3 Monate",7000,"Re.-Trapez."]
[null,"Milchmast",null,{"$f":"IF(D6=1,\"Flachstreu\",\"FB Gülle\")","v":"FB Gülle"},"4 Monate",8000]
[null,"Weitermast",null,{"$f":"IF(D6=1,\"Tretmist\",\"FB Mist\")","v":"FB Mist"},"5 Monate",9000,"wasserdicht"]
[null,null,null,{"$f":"IF(D6=1,\"Teiltiefstreu\",\"o.sep. FB\")","v":"o.sep. FB"},"6 Monate",10000,"wasserdurchl."]
[1,1,null,null,"7 Monate",11000]
[2,0.86599999999999999,"0,9 Kalb",null,"8 Monate",12000,"ja"]
[3,0.8,"ohne Kalb",null,"9 Monate",13000,"nein"]
[4,0.76,null,null,"10 Monate",14000]
[5,0.73,null,null,"11 Monate"]
[6,0.73,null,null,"12 Monate"]
[]
[]
[null,null,null,null,"Flachstreu"]
[null,null,null,null,"Tretmist"]
[]
[]
[]
[]
[]
[]
[]
[]
[]
[]
[]
[]
[]
[]
[]
[]
[]
[]
[]
[]
[]
[]
[]
[]
[]
[]
[]
[]
[]
[]
[]
[]
[]
[]
[]
[]
[]
[]
[]
[]
[]
[]
[]
[]
[]
[]
[]
[]
[]
[]
[]
[]
[]
[]
[]
[]
[]
[]
[]
[]
[]
[]
[]
[]
[]
[]
[]
[]
[]
[]
[]
[]
[]
[]
[]
[]
[]
[]
[]
[]
[]
[]
[]
[]
[]
[]
[]
[]
[]
[]
[]
[]
[]
[]
[]
[]
[]
[]
[]
[]
[]
[]
[]
[]
[]
[]
[]
[]
[]
[]
[]
[]
[]
[]
[]
[]
[]
[]
[]
[]
[]
[]
[]
[]
[]
[]
[]
[]
[]
[]
[]
[]
[]
[]
[]
[]
[]
[]
[]
[]
[]
[]
[]
[]
[]
[]
[]
[]
[]
[]
[]
[]
[]
[]
[]
[]
[]
[]
[]
[]
[]
[]
[]
[]
[]
[]
[]
[]
[]
[]
[]
[]
[]
[]
[]
[]
[]
[]
[]
[]
[]
[]
[]
[]
[]
[]
[]
[]
[]
[]
[]
[]
[]
[]
[]
[]
[]
[]
[]
[]
[]
[]
[]
[]
[]
[]
[]
[]
[]
[]
[]
[]
[]
[]
[]
[]
[]
[]
[]
[]
[]
[]
[]
[]
[]
[]
[]
[]
[]
[]
[]
[]
[]
[]
[]
[]
[]
[]
[]
[]
[]
[]
[]
[]
[]
[]
[]
[]
[]
[]
[]
[]
[]
[]
[]
[]
[]
[]
[]
[]
[]
[]
[]
[]
[]
[]
[]
[]
[]
[]
[]
[]
[]
[]
[]
[]
[]
[]
[]
[]
[]
[]
[]
[]
[]
[]
[]
[]
[]
[]
[]
[]
[]
[]
[]
[]
[]
[]
[]
[]
[]
[]
[]
[]
[]
[]
[]
[]
[]
[]
[]
[]
[]
[]
[]
[]
[]
[]
[]
[]
[]
[]
[]
[]
[]
[]
[]
[]
[]
[]
[]
[]
[]
[]
[]
[]
[]
[]
[]
[]
[]
[]
[]
[]
[]
[]
[]
[]
[]
[]
[]
[]
[]
[]
[]
[]
[]
[]
[]
[]
[]
[]
[]
[]
[]
[]
[]
[]
[]
[]
[]
[]
[]
[]
[]
[]
[]
[]
[]
[]
[]
[]
[]
[]
[]
[]
[]
[]
[]
[]
[]
[]
[]
[]
[]
[]
[]
[]
[]
[]
[]
[]
[]
[]
[]
[]
[]
[]
[]
[]
[]
[]
[]
[]
[]
[]
[]
[]
[]
[]
[]
[]
[]
[]
[]
[]
[]
[]
[]
[]
[]
[]
[]
[]
[]
[]
[]
[]
[]
[]
[]
[]
[]
[]
[]
[]
[]
[]
[]
[]
[]
[]
[]
[]
[]
[]
[]
[]
[]
[]
[]
[]
[]
[]
[]
[]
[]
[]
[]
[]
[]
[]
[]
[]
[]
[]
[]
[]
[]
[]
[]
[]
[]
[]
[]
[]
[]
[]
[]
[]
[]
[]
[]
[]
[]
[]
[]
[]
[]
[]
[]
[]
[]
[]
[]
[]
[]
[]
[]
[]
[]
[]
[]
[]
[]
[]
[]
[]
[]
[]
[]
[]
[]
[]
[]
[]
[]
[]
[]
[]
[]
[]
[]
[]
[]
[]
[]
[]
[]
[]
[]
[]
[]
[]
[]
[]
[]
[]
[]
[]
[]
[]
[]
[]
[]
[]
[]
[]
[]
[]
[]
[]
[]
[]
[]
[]
[]
[]
[]
[]
[]
[]
[]
[]
[]
[]
[]
[]
[]
[]
[]
[]
[]
[]
[]
[]
[]
[]
[]
[]
[]
[]
[]
[]
[]
[]
[]
[]
[]
[]
[]
[]
[]
[]
[]
[]
[]
[]
[]
[]
[]
[]
[]
[]
[]
[]
[]
[]
[]
[]
[]
[]
[]
[]
[]
[]
[]
[]
[]
[]
[]
[]
[]
[]
[]
[]
[]
[]
[]
[]
[]
[]
[]
[]
[]
[]
[]
[]
[]
[]
[]
[]
[]
[]
[]
[]
[]
[]
[]
[]
[]
[]
[]
[]
[]
[]
[]
[]
[]
[]
[]
[]
[]
[]
[]
[]
[]
[]
[]
[]
[]
[]
[]
[]
[]
[]
[]
[]
[]
[]
[]
[]
[]
[]
[]
[]
[]
[]
[]
[]
[]
[]
[]
[]
[]
[]
[]
[]
[]
[]
[]
[]
[]
[]
[]
[]
[]
[]
[]
[]
[]
[]
[]
[]
[]
[]
[]
[]
[]
[]
[]
[]
[]
[]
[]
[]
[]
[]
[]
[]
[]
[]
[]
[]
[]
[]
[]
[]
[]
[]
[]
[]
[]
[]
[]
[]
[]
[]
[]
[]
[]
[]
[]
[]
[]
[]
[]
[]
[]
[]
[]
[]
[]
[]
[]
[]
[]
[]
[]
[]
[]
[]
[]
[]
[]
[]
[]
[]
[]
[]
[]
[]
[]
[]
[]
[]
[]
[]
[]
[]
[]
[]
[]
[]
[]
[]
[]
[]
[]
[]
[]
[]
[]
[]
[]
[]
[]
[]
[]
[]
[]
[]
[]
[]
[]
[]
[]
[]
[]
[]
[]
[]
[]
[]
[]
[]
[]
[]
[]
[]
[]
[]
[]
[]
[]
[]
[]
[]
[]
[]
[]
[]
[]
[]
[]
[]
[]
[]
[]
[]
[]
[]
[]
[]
[]
[]
[]
[]
[]
[]
[]
[]
[]
[]
[]
[]
[]
[]
[]
[]
[]
[]
[]
[]
[]
[]
[]
[]
[]
[]
[]
[]
[]
[]
[]
[]
[]
[]
[]
[]
[]
[]
[]
[]
[]
[]
[]
[]
[]
[]
[]
[]
[]
[]
[]
[]
[]
[]
[]
[]
[]
[]
[]
[]
[]
[]
[]
[]
[]
[]
[]
[]
[]
[]
[]
[]
[]
[]
[]
[]
[]
[]
[]
[]
[]
[]
[]
[]
[]
[]
[]
[]
[]
[]
[]
[]
[]
[]
[]
[]
[]
[]
[]
[]
[]
[]
[]
[]
[]
[]
[]
[]
[]
[]
[]
[]
[]
[]
[]
[]
[]
[]
[]
[]
[]
[]
[]
[]
[]
[]
[]
[]
[]
[]
[]
[]
[]
[]
[]
[]
[]
[]
[]
[]
[]
[]
[]
[]
[]
[]
[]
[]
[]
[]
[]
[]
[]
[]
[]
[]
[]
[]
[]
[]
[]
[]
[]
[]
[]
[]
[]
[]
[]
[]
[]
[]
[]
[]
[]
[]
[]
[]
[]
[]
[]
[]
[]
[]
[]
[]
[]
[]
[]
[]
[]
[]
[]
[]
[]
[]
[]
[]
[]
[]
[]
[]
[]
[]
[]
[]
[]
[]
[]
[]
[]
[]
[]
[]
[]
[]
[]
[]
[]
[]
[]
[]
[]
[]
[]
[]
[]
[]
[]
[]
[]
[]
[]
[]
[]
[]
[]
[]
[]
[]
[]
[]
[]
[]
[]
[]
[]
[]
[]
[]
[]
[]
[]
[]
[]
[]
[]
[]
[]
[]
[]
[]
[]
[]
[]
[]
[]
[]
[]
[]
[]
[]
[]
[]
[]
[]
[]
[]
[]
[]
[]
[]
[]
[]
[]
[]
[]
[]
[]
[]
[]
[]
[]
[]
[]
[]
[]
[]
[]
[]
[]
[]
[]
[]
[]
[]
[]
[]
[]
[]
[]
[]
[]
[]
[]
[]
[]
[]
[]
[]
[]
[]
[]
[]
[]
[]
[]
[]
[]
[]
[]
[]
[]
[]
[]
[]
[]
[]
[]
[]
[]
[]
[]
[]
[]
[]
[]
[]
[]
[]
[]
[]
[]
[]
[]
[]
[]
[]
[]
[]
[]
[]
[]
[]
[]
[]
[]
[]
[]
[]
[]
[]
[]
[]
[]
[]
[]
[]
[]
[]
[]
[]
[]
[]
[]
[]
[]
[]
[]
[]
[]
[]
[]
[]
[]
[]
[]
[]
[]
[]
[]
[]
[]
[]
[]
[]
[]
[]
[]
[]
[]
[]
[]
[]
[]
[]
[]
[]
[]
[]
[]
[]
[]
[]
[]
[]
[]
[]
[]
[]
[]
[]
[]
[]
[]
[]
[]
[]
[]
[]
[]
[]
[]
[]
[]
[]
[]
[]
[]
[]
[]
[]
[]
[]
[]
[]
[]
[]
[]
[]
[]
[]
[]
[]
[]
[]
[]
[]
[]
[]
[]
[]
[]
[]
[]
[]
[]
[]
[]
[]
[]
[]
[]
[]
[]
[]
[]
[]
[]
[]
[]
[]
[]
[]
[]
[]
[]
[]
[]
[]
[]
[]
[]
[]
[]
[]
[]
[]
[]
[]
[]
[]
[]
[]
[]
[]
[]
[]
[]
[]
[]
[]
[]
[]
[]
[]
[]
[]
[]
[]
[]
[]
[]
[]
[]
[]
[]
[]
[]
[]
[]
[]
[]
[]
[]
[]
[]
[]
[]
[]
[]
[]
[]
[]
[]
[]
[]
[]
[]
[]
[]
[]
[]
[]
[]
[]
[]
[]
[]
[]
[]
[]
[]
[]
[]
[]
[]
[]
[]
[]
[]
[]
[]
[]
[]
[]
[]
[]
[]
[]
[]
[]
[]
[]
[]
[]
[]
[]
[]
[]
[]
[]
[]
[]
[]
[]
[]
[]
[]
[]
[]
[]
[]
[]
[]
[]
[]
[]
[]
[]
[]
[]
[]
[]
[]
[]
[]
[]
[]
[]
[]
[]
[]
[]
[]
[]
[]
[]
[]
[]
[]
[]
[]
[]
[]
[]
[]
[]
[]
[]
[]
[]
[]
[]
[]
[]
[]
[]
[]
[]
[]
[]
[]
[]
[]
[]
[]
[]
[]
[]
[]
[]
[]
[]
[]
[]
[]
[]
[]
[]
[]
[]
[]
[]
[]
[]
[]
[]
[]
[]
[]
[]
[]
[]
[]
[]
[]
[]
[]
[]
[]
[]
[]
[]
[]
[]
[]
[]
[]
[]
[]
[]
[]
[]
[]
[]
[]
[]
[]
[]
[]
[]
[]
[]
[]
[]
[]
[]
[]
[]
[]
[]
[]
[]
[]
[]
[]
[]
[]
[]
[]
[]
[]
[]
[]
[]
[]
[]
[]
[]
[]
[]
[]
[]
[]
[]
[]
[]
[]
[]
[]
[]
[]
[]
[]
[]
[]
[]
[]
[]
[]
[]
[]
[]
[]
[]
[]
[]
[]
[]
[]
[]
[]
[]
[]
[]
[]
[]
[]
[]
[]
[]
[]
[]
[]
[]
[]
[]
[]
[]
[]
[]
[]
[]
[]
[]
[]
[]
[]
[]
[]
[]
[]
[]
[]
[]
[]
[]
[]
[]
[]
[]
[]
[]
[]
[]
[]
[]
[]
[]
[]
[]
[]
[]
[]
[]
[]
[]
[]
[]
[]
[]
[]
[]
[]
[]
[]
[]
[]
[]
[]
[]
[]
[]
[]
[]
[]
[]
[]
[]
[]
[]
[]
[]
[]
[]
[]
[]
[]
[]
[]
[]
[]
[]
[]
[]
[]
[]
[]
[]
[]
[]
[]
[]
[]
[]
[]
[]
[]
[]
[]
[]
[]
[]
[]
[]
[]
[]
[]
[]
[]
[]
[]
[]
[]
[]
[]
[]
[]
[]
[]
[]
[]
[]
[]
[]
[]
[]
[]
[]
[]
[]
[]
[]
[]
[]
[]
[]
[]
[]
[]
[]
[]
[]
[]
[]
[]
[]
[]
[]
[]
[]
[]
[]
[]
[]
[]
[]
[]
[]
[]
[]
[]
[]
[]
[]
[]
[]
[]
[]
[]
[]
[]
[]
[]
[]
[]
[]
[]
[]
[]
[]
[]
[]
[]
[]
[]
[]
[]
[]
[]
[]
[]
[]
[]
[]
[]
[]
[]
[]
[]
[]
[]
[]
[]
[]
[]
[]
[]
[]
[]
[]
[]
[]
[]
[]
[]
[]
[]
[]
[]
[]
[]
[]
[]
[]
[]
[]
[]
[]
[]
[]
[]
[]
[]
[]
[]
[]
[]
[]
[]
[]
[]
[]
[]
[]
[]
[]
[]
[]
[]
[]
[]
[]
[]
[]
[]
[]
[]
[]
[]
[]
[]
[]
[]
[]
[]
[]
[]
[]
[]
[]
[]
[]
[]
[]
[]
[]
[]
[]
[]
[]
[]
[]
[]
[]
[]
[]
[]
[]
[]
[]
[]
[]
[]
[]
[]
[]
[]
[]
[]
[]
[]
[]
[]
[]
[]
[]
[]
[]
[]
[]
[]
[]
[]
[]
[]
[]
[]
[]
[]
[]
[]
[]
[]
[]
[]
[]
[]
[]
[]
[]
[]
[]
[]
[]
[]
[]
[]
[]
[]
[]
[]
[]
[]
[]
[]
[]
[]
[]
[]
[]
[]
[]
[]
[]
[]
[]
[]
[]
[]
[]
[]
[]
[]
[]
[]
[]
[]
[]
[]
[]
[]
[]
[]
[]
[]
[]
[]
[]
[]
[]
[]
[]
[]
[]
[]
[]
[]
[]
[]
[]
[]
[]
[]
[]
[]
[]
[]
[]
[]
[]
[]
[]
[]
[]
[]
[]
[]
[]
[]
[]
[]
[]
[]
[]
[]
[]
[]
[]
[]
[]
[]
[]
[]
[]
[]
[]
[]
[]
[]
[]
[]
[]
[]
[]
[]
[]
[]
[]
[]
[]
[]
[]
[]
[]
[]
[]
[]
[]
[]
[]
[]
[]
[]
[]
[]
[]
[]
[]
[]
[]
[]
[]
[]
[]
[]
[]
[]
[]
[]
[]
[]
[]
[]
[]
[]
[]
[]
[]
[]
[]
[]
[]
[]
[]
[]
[]
[]
[]
[]
[]
[]
[]
[]
[]
[]
[]
[]
[]
[]
[]
[]
[]
[]
[]
[]
[]
[]
[]
[]
[]
[]
[]
[]
[]
[]
[]
[]
[]
[]
[]
[]
[]
[]
[]
[]
[]
[]
[]
[]
[]
[]
[]
[]
[]
[]
[]
[]
[]
[]
[]
[]
[]
[]
[]
[]
[]
[]
[]
[]
[]
[]
[]
[]
[]
[]
[]
[]
[]
[]
[]
[]
[]
[]
[]
[]
[]
[]
[]
[]
[]
[]
[]
[]
[]
[]
[]
[]
[]
[]
[]
[]
[]
[]
[]
[]
[]
[]
[]
[]
[]
[]
[]
[]
[]
[]
[]
[]
[]
[]
[]
[]
[]
[]
[]
[]
[]
[]
[]
[]
[]
[]
[]
[]
[]
[]
[]
[]
[]
[]
[]
[]
[]
[]
[]
[]
[]
[]
[]
[]
[]
[]
[]
[]
[]
[]
[]
[]
[]
[]
[]
[]
[]
[]
[]
[]
[]
[]
[]
[]
[]
[]
[]
[]
[]
[]
[]
[]
[]
[]
[]
[]
[]
[]
[]
[]
[]
[]
[]
[]
[]
[]
[]
[]
[]
[]
[]
[]
[]
[]
[]
[]
[]
[]
[]
[]
[]
[]
[]
[]
[]
[]
[]
[]
[]
[]
[]
[]
[]
[]
[]
[]
[]
[]
[]
[]
[]
[]
[]
[]
[]
[]
[]
[]
[]
[]
[]
[]
[]
[]
[]
[]
[]
[]
[]
[]
[]
[]
[]
[]
[]
[]
[]
[]
[]
[]
[]
[]
[]
[]
[]
[]
[]
[]
[]
[]
[]
[]
[]
[]
[]
[]
[]
[]
[]
[]
[]
[]
[]
[]
[]
[]
[]
[]
[]
[]
[]
[]
[]
[]
[]
[]
[]
[]
[]
[]
[]
[]
[]
[]
[]
[]
[]
[]
[]
[]
[]
[]
[]
[]
[]
[]
[]
[]
[]
[]
[]
[]
[]
[]
[]
[]
[]
[]
[]
[]
[]
[]
[]
[]
[]
[]
[]
[]
[]
[]
[]
[]
[]
[]
[]
[]
[]
[]
[]
[]
[]
[]
[]
[]
[]
[]
[]
[]
[]
[]
[]
[]
[]
[]
[]
[]
[]
[]
[]
[]
[]
[]
[]
[]
[]
[]
[]
[]
[]
[]
[]
[]
[]
[]
[]
[]
[]
[]
[]
[]
[]
[]
[]
[]
[]
[]
[]
[]
[]
[]
[]
[]
[]
[]
[]
[]
[]
[]
[]
[]
[]
[]
[]
[]
[]
[]
[]
[]
[]
[]
[]
[]
[]
[]
[]
[]
[]
[]
[]
[]
[]
[]
[]
[]
[]
[]
[]
[]
[]
[]
[]
[]
[]
[]
[]
[]
[]
[]
[]
[]
[]
[]
[]
[]
[]
[]
[]
[]
[]
[]
[]
[]
[]
[]
[]
[]
[]
[]
[]
[]
[]
[]
[]
[]
[]
[]
[]
[]
[]
[]
[]
[]
[]
[]
[]
[]
[]
[]
[]
[]
[]
[]
[]
[]
[]
[]
[]
[]
[]
[]
[]
[]
[]
[]
[]
[]
[]
[]
[]
[]
[]
[]
[]
[]
[]
[]
[]
[]
[]
[]
[]
[]
[]
[]
[]
[]
[]
[]
[]
[]
[]
[]
[]
[]
[]
[]
[]
[]
[]
[]
[]
[]
[]
[]
[]
[]
[]
[]
[]
[]
[]
[]
[]
[]
[]
[]
[]
[]
[]
[]
[]
[]
[]
[]
[]
[]
[]
[]
[]
[]
[]
[]
[]
[]
[]
[]
[]
[]
[]
[]
[]
[]
[]
[]
[]
[]
[]
[]
[]
[]
[]
[]
[]
[]
[]
[]
[]
[]
[]
[]
[]
[]
[]
[]
[]
[]
[]
[]
[]
[]
[]
[]
[]
[]
[]
[]
[]
[]
[]
[]
[]
[]
[]
[]
[]
[]
[]
[]
[]
[]
[]
[]
[]
[]
[]
[]
[]
[]
[]
[]
[]
[]
[]
[]
[]
[]
[]
[]
[]
[]
[]
[]
[]
[]
[]
[]
[]
[]
[]
[]
[]
[]
[]
[]
[]
[]
[]
[]
[]
[]
[]
[]
[]
[]
[]
[]
[]
[]
[]
[]
[]
[]
[]
[]
[]
[]
[]
[]
[]
[]
[]
[]
[]
[]
[]
[]
[]
[]
[]
[]
[]
[]
[]
[]
[]
[]
[]
[]
[]
[]
[]
[]
[]
[]
[]
[]
[]
[]
[]
[]
[]
[]
[]
[]
[]
[]
[]
[]
[]
[]
[]
[]
[]
[]
[]
[]
[]
[]
[]
[]
[]
[]
[]
[]
[]
[]
[]
[]
[]
[]
[]
[]
[]
[]
[]
[]
[]
[]
[]
[]
[]
[]
[]
[]
[]
[]
[]
[]
[]
[]
[]
[]
[]
[]
[]
[]
[]
[]
[]
[]
[]
[]
[]
[]
[]
[]
[]
[]
[]
[]
[]
[]
[]
[]
[]
[]
[]
[]
[]
[]
[]
[]
[]
[]
[]
[]
[]
[]
[]
[]
[]
[]
[]
[]
[]
[]
[]
[]
[]
[]
[]
[]
[]
[]
[]
[]
[]
[]
[]
[]
[]
[]
[]
[]
[]
[]
[]
[]
[]
[]
[]
[]
[]
[]
[]
[]
[]
[]
[]
[]
[]
[]
[]
[]
[]
[]
[]
[]
[]
[]
[]
[]
[]
[]
[]
[]
[]
[]
[]
[]
[]
[]
[]
[]
[]
[]
[]
[]
[]
[]
[]
[]
[]
[]
[]
[]
[]
[]
[]
[]
[]
[]
[]
[]
[]
[]
[]
[]
[]
[]
[]
[]
[]
[]
[]
[]
[]
[]
[]
[]
[]
[]
[]
[]
[]
[]
[]
[]
[]
[]
[]
[]
[]
[]
[]
[]
[]
[]
[]
[]
[]
[]
[]
[]
[]
[]
[]
[]
[]
[]
[]
[]
[]
[]
[]
[]
[]
[]
[]
[]
[]
[]
[]
[]
[]
[]
[]
[]
[]
[]
[]
[]
[]
[]
[]
[]
[]
[]
[]
[]
[]
[]
[]
[]
[]
[]
[]
[]
[]
[]
[]
[]
[]
[]
[]
[]
[]
[]
[]
[]
[]
[]
[]
[]
[]
[]
[]
[]
[]
[]
[]
[]
[]
[]
[]
[]
[]
[]
[]
[]
[]
[]
[]
[]
[]
[]
[]
[]
[]
[]
[]
[]
[]
[]
[]
[]
[]
[]
[]
[]
[]
[]
[]
[]
[]
[]
[]
[]
[]
[]
[]
[]
[]
[]
[]
[]
[]
[]
[]
[]
[]
[]
[]
[]
[]
[]
[]
[]
[]
[]
[]
[]
[]
[]
[]
[]
[]
[]
[]
[]
[]
[]
[]
[]
[]
[]
[]
[]
[]
[]
[]
[]
[]
[]
[]
[]
[]
[]
[]
[]
[]
[]
[]
[]
[]
[]
[]
[]
[]
[]
[]
[]
[]
[]
[]
[]
[]
[]
[]
[]
[]
[]
[]
[]
[]
[]
[]
[]
[]
[]
[]
[]
[]
[]
[]
[]
[]
[]
[]
[]
[]
[]
[]
[]
[]
[]
[]
[]
[]
[]
[]
[]
[]
[]
[]
[]
[]
[]
[]
[]
[]
[]
[]
[]
[]
[]
[]
[]
[]
[]
[]
[]
[]
[]
[]
[]
[]
[]
[]
[]
[]
[]
[]
[]
[]
[]
[]
[]
[]
[]
[]
[]
[]
[]
[]
[]
[]
[]
[]
[]
[]
[]
[]
[]
[]
[]
[]
[]
[]
[]
[]
[]
[]
[]
[]
[]
[]
[]
[]
[]
[]
[]
[]
[]
[]
[]
[]
[]
[]
[]
[]
[]
[]
[]
[]
[]
[]
[]
[]
[]
[]
[]
[]
[]
[]
[]
[]
[]
[]
[]
[]
[]
[]
[]
[]
[]
[]
[]
[]
[]
[]
[]
[]
[]
[]
[]
[]
[]
[]
[]
[]
[]
[]
[]
[]
[]
[]
[]
[]
[]
[]
[]
[]
[]
[]
[]
[]
[]
[]
[]
[]
[]
[]
[]
[]
[]
[]
[]
[]
[]
[]
[]
[]
[]
[]
[]
[]
[]
[]
[]
[]
[]
[]
[]
[]
[]
[]
[]
[]
[]
[]
[]
[]
[]
[]
[]
[]
[]
[]
[]
[]
[]
[]
[]
[]
[]
[]
[]
[]
[]
[]
[]
[]
[]
[]
[]
[]
[]
[]
[]
[]
[]
[]
[]
[]
[]
[]
[]
[]
[]
[]
[]
[]
[]
[]
[]
[]
[]
[]
[]
[]
[]
[]
[]
[]
[]
[]
[]
[]
[]
[]
[]
[]
[]
[]
[]
[]
[]
[]
[]
[]
[]
[]
[]
[]
[]
[]
[]
[]
[]
[]
[]
[]
[]
[]
[]
[]
[]
[]
[]
[]
[]
[]
[]
[]
[]
[]
[]
[]
[]
[]
[]
[]
[]
[]
[]
[]
[]
[]
[]
[]
[]
[]
[]
[]
[]
[]
[]
[]
[]
[]
[]
[]
[]
[]
[]
[]
[]
[]
[]
[]
[]
[]
[]
[]
[]
[]
[]
[]
[]
[]
[]
[]
[]
[]
[]
[]
[]
[]
[]
[]
[]
[]
[]
[]
[]
[]
[]
[]
[]
[]
[]
[]
[]
[]
[]
[]
[]
[]
[]
[]
[]
[]
[]
[]
[]
[]
[]
[]
[]
[]
[]
[]
[]
[]
[]
[]
[]
[]
[]
[]
[]
[]
[]
[]
[]
[]
[]
[]
[]
[]
[]
[]
[]
[]
[]
[]
[]
[]
[]
[]
[]
[]
[]
[]
[]
[]
[]
[]
[]
[]
[]
[]
[]
[]
[]
[]
[]
[]
[]
[]
[]
[]
[]
[]
[]
[]
[]
[]
[]
[]
[]
[]
[]
[]
[]
[]
[]
[]
[]
[]
[]
[]
[]
[]
[]
[]
[]
[]
[]
[]
[]
[]
[]
[]
[]
[]
[]
[]
[]
[]
[]
[]
[]
[]
[]
[]
[]
[]
[]
[]
[]
[]
[]
[]
[]
[]
[]
[]
[]
[]
[]
[]
[]
[]
[]
[]
[]
[]
[]
[]
[]
[]
[]
[]
[]
[]
[]
[]
[]
[]
[]
[]
[]
[]
[]
[]
[]
[]
[]
[]
[]
[]
[]
[]
[]
[]
[]
[]
[]
[]
[]
[]
[]
[]
[]
[]
[]
[]
[]
[]
[]
[]
[]
[]
[]
[]
[]
[]
[]
[]
[]
[]
[]
[]
[]
[]
[]
[]
[]
[]
[]
[]
[]
[]
[]
[]
[]
[]
[]
[]
[]
[]
[]
[]
[]
[]
[]
[]
[]
[]
[]
[]
[]
[]
[]
[]
[]
[]
[]
[]
[]
[]
[]
[]
[]
[]
[]
[]
[]
[]
[]
[]
[]
[]
[]
[]
[]
[]
[]
[]
[]
[]
[]
[]
[]
[]
[]
[]
[]
[]
[]
[]
[]
[]
[]
[]
[]
[]
[]
[]
[]
[]
[]
[]
[]
[]
[]
[]
[]
[]
[]
[]
[]
[]
[]
[]
[]
[]
[]
[]
[]
[]
[]
[]
[]
[]
[]
[]
[]
[]
[]
[]
[]
[]
[]
[]
[]
[]
[]
[]
[]
[]
[]
[]
[]
[]
[]
[]
[]
[]
[]
[]
[]
[]
[]
[]
[]
[]
[]
[]
[]
[]
[]
[]
[]
[]
[]
[]
[]
[]
[]
[]
[]
[]
[]
[]
[]
[]
[]
[]
[]
[]
[]
[]
[]
[]
[]
[]
[]
[]
[]
[]
[]
[]
[]
[]
[]
[]
[]
[]
[]
[]
[]
[]
[]
[]
[]
[]
[]
[]
[]
[]
[]
[]
[]
[]
[]
[]
[]
[]
[]
[]
[]
[]
[]
[]
[]
[]
[]
[]
[]
[]
[]
[]
[]
[]
[]
[]
[]
[]
[]
[]
[]
[]
[]
[]
[]
[]
[]
[]
[]
[]
[]
[]
[]
[]
[]
[]
[]
[]
[]
[]
[]
[]
[]
[]
[]
[]
[]
[]
[]
[]
[]
[]
[]
[]
[]
[]
[]
[]
[]
[]
[]
[]
[]
[]
[]
[]
[]
[]
[]
[]
[]
[]
[]
[]
[]
[]
[]
[]
[]
[]
[]
[]
[]
[]
[]
[]
[]
[]
[]
[]
[]
[]
[]
[]
[]
[]
[]
[]
[]
[]
[]
[]
[]
[]
[]
[]
[]
[]
[]
[]
[]
[]
[]
[]
[]
[]
[]
[]
[]
[]
[]
[]
[]
[]
[]
[]
[]
[]
[]
[]
[]
[]
[]
[]
[]
[]
[]
[]
[]
[]
[]
[]
[]
[]
[]
[]
[]
[]
[]
[]
[]
[]
[]
[]
[]
[]
[]
[]
[]
[]
[]
[]
[]
[]
[]
[]
[]
[]
[]
[]
[]
[]
[]
[]
[]
[]
[]
[]
[]
[]
[]
[]
[]
[]
[]
[]
[]
[]
[]
[]
[]
[]
[]
[]
[]
[]
[]
[]
[]
[]
[]
[]
[]
[]
[]
[]
[]
[]
[]
[]
[]
[]
[]
[]
[]
[]
[]
[]
[]
[]
[]
[]
[]
[]
[]
[]
[]
[]
[]
[]
[]
[]
[]
[]
[]
[]
[]
[]
[]
[]
[]
[]
[]
[]
[]
[]
[]
[]
[]
[]
[]
[]
[]
[]
[]
[]
[]
[]
[]
[]
[]
[]
[]
[]
[]
[]
[]
[]
[]
[]
[]
[]
[]
[]
[]
[]
[]
[]
[]
[]
[]
[]
[]
[]
[]
[]
[]
[]
[]
[]
[]
[]
[]
[]
[]
[]
[]
[]
[]
[]
[]
[]
[]
[]
[]
[]
[]
[]
[]
[]
[]
[]
[]
[]
[]
[]
[]
[]
[]
[]
[]
[]
[]
[]
[]
[]
[]
[]
[]
[]
[]
[]
[]
[]
[]
[]
[]
[]
[]
[]
[]
[]
[]
[]
[]
[]
[]
[]
[]
[]
[]
[]
[]
[]
[]
[]
[]
[]
[]
[]
[]
[]
[]
[]
[]
[]
[]
[]
[]
[]
[]
[]
[]
[]
[]
[]
[]
[]
[]
[]
[]
[]
[]
[]
[]
[]
[]
[]
[]
[]
[]
[]
[]
[]
[]
[]
[]
[]
[]
[]
[]
[]
[]
[]
[]
[]
[]
[]
[]
[]
[]
[]
[]
[]
[]
[]
[]
[]
[]
[]
[]
[]
[]
[]
[]
[]
[]
[]
[]
[]
[]
[]
[]
[]
[]
[]
[]
[]
[]
[]
[]
[]
[]
[]
[]
[]
[]
[]
[]
[]
[]
[]
[]
[]
[]
[]
[]
[]
[]
[]
[]
[]
[]
[]
[]
[]
[]
[]
[]
[]
[]
[]
[]
[]
[]
[]
[]
[]
[]
[]
[]
[]
[]
[]
[]
[]
[]
[]
[]
[]
[]
[]
[]
[]
[]
[]
[]
[]
[]
[]
[]
[]
[]
[]
[]
[]
[]
[]
[]
[]
[]
[]
[]
[]
[]
[]
[]
[]
[]
[]
[]
[]
[]
[]
[]
[]
[]
[]
[]
[]
[]
[]
[]
[]
[]
[]
[]
[]
[]
[]
[]
[]
[]
[]
[]
[]
[]
[]
[]
[]
[]
[]
[]
[]
[]
[]
[]
[]
[]
[]
[]
[]
[]
[]
[]
[]
[]
[]
[]
[]
[]
[]
[]
[]
[]
[]
[]
[]
[]
[]
[]
[]
[]
[]
[]
[]
[]
[]
[]
[]
[]
[]
[]
[]
[]
[]
[]
[]
[]
[]
[]
[]
[]
[]
[]
[]
[]
[]
[]
[]
[]
[]
[]
[]
[]
[]
[]
[]
[]
[]
[]
[]
[]
[]
[]
[]
[]
[]
[]
[]
[]
[]
[]
[]
[]
[]
[]
[]
[]
[]
[]
[]
[]
[]
[]
[]
[]
[]
[]
[]
[]
[]
[]
[]
[]
[]
[]
[]
[]
[]
[]
[]
[]
[]
[]
[]
[]
[]
[]
[]
[]
[]
[]
[]
[]
[]
[]
[]
[]
[]
[]
[]
[]
[]
[]
[]
[]
[]
[]
[]
[]
[]
[]
[]
[]
[]
[]
[]
[]
[]
[]
[]
[]
[]
[]
[]
[]
[]
[]
[]
[]
[]
[]
[]
[]
[]
[]
[]
[]
[]
[]
[]
[]
[]
[]
[]
[]
[]
[]
[]
[]
[]
[]
[]
[]
[]
[]
[]
[]
[]
[]
[]
[]
[]
[]
[]
[]
[]
[]
[]
[]
[]
[]
[]
[]
[]
[]
[]
[]
[]
[]
[]
[]
[]
[]
[]
[]
[]
[]
[]
[]
[]
[]
[]
[]
[]
[]
[]
[]
[]
[]
[]
[]
[]
[]
[]
[]
[]
[]
[]
[]
[]
[]
[]
[]
[]
[]
[]
[]
[]
[]
[]
[]
[]
[]
[]
[]
[]
[]
[]
[]
[]
[]
[]
[]
[]
[]
[]
[]
[]
[]
[]
[]
[]
[]
[]
[]
[]
[]
[]
[]
[]
[]
[]
[]
[]
[]
[]
[]
[]
[]
[]
[]
[]
[]
[]
[]
[]
[]
[]
[]
[]
[]
[]
[]
[]
[]
[]
[]
[]
[]
[]
[]
[]
[]
[]
[]
[]
[]
[]
[]
[]
[]
[]
[]
[]
[]
[]
[]
[]
[]
[]
[]
[]
[]
[]
[]
[]
[]
[]
[]
[]
[]
[]
[]
[]
[]
[]
[]
[]
[]
[]
[]
[]
[]
[]
[]
[]
[]
[]
[]
[]
[]
[]
[]
[]
[]
[]
[]
[]
[]
[]
[]
[]
[]
[]
[]
[]
[]
[]
[]
[]
[]
[]
[]
[]
[]
[]
[]
[]
[]
[]
[]
[]
[]
[]
[]
[]
[]
[]
[]
[]
[]
[]
[]
[]
[]
[]
[]
[]
[]
[]
[]
[]
[]
[]
[]
[]
[]
[]
[]
[]
[]
[]
[]
[]
[]
[]
[]
[]
[]
[]
[]
[]
[]
[]
[]
[]
[]
[]
[]
[]
[]
[]
[]
[]
[]
[]
[]
[]
[]
[]
[]
[]
[]
[]
[]
[]
[]
[]
[]
[]
[]
[]
[]
[]
[]
[]
[]
[]
[]
[]
[]
[]
[]
[]
[]
[]
[]
[]
[]
[]
[]
[]
[]
[]
[]
[]
[]
[]
[]
[]
[]
[]
[]
[]
[]
[]
[]
[]
[]
[]
[]
[]
[]
[]
[]
[]
[]
[]
[]
[]
[]
[]
[]
[]
[]
[]
[]
[]
[]
[]
[]
[]
[]
[]
[]
[]
[]
[]
[]
[]
[]
[]
[]
[]
[]
[]
[]
[]
[]
[]
[]
[]
[]
[]
[]
[]
[]
[]
[]
[]
[]
[]
[]
[]
[]
[]
[]
[]
[]
[]
[]
[]
[]
[]
[]
[]
[]
[]
[]
[]
[]
[]
[]
[]
[]
[]
[]
[]
[]
[]
[]
[]
[]
[]
[]
[]
[]
[]
[]
[]
[]
[]
[]
[]
[]
[]
[]
[]
[]
[]
[]
[]
[]
[]
[]
[]
[]
[]
[]
[]
[]
[]
[]
[]
[]
[]
[]
[]
[]
[]
[]
[]
[]
[]
[]
[]
[]
[]
[]
[]
[]
[]
[]
[]
[]
[]
[]
[]
[]
[]
[]
[]
[]
[]
[]
[]
[]
[]
[]
[]
[]
[]
[]
[]
[]
[]
[]
[]
[]
[]
[]
[]
[]
[]
[]
[]
[]
[]
[]
[]
[]
[]
[]
[]
[]
[]
[]
[]
[]
[]
[]
[]
[]
[]
[]
[]
[]
[]
[]
[]
[]
[]
[]
[]
[]
[]
[]
[]
[]
[]
[]
[]
[]
[]
[]
[]
[]
[]
[]
[]
[]
[]
[]
[]
[]
[]
[]
[]
[]
[]
[]
[]
[]
[]
[]
[]
[]
[]
[]
[]
[]
[]
[]
[]
[]
[]
[]
[]
[]
[]
[]
[]
[]
[]
[]
[]
[]
[]
[]
[]
[]
[]
[]
[]
[]
[]
[]
[]
[]
[]
[]
[]
[]
[]
[]
[]
[]
[]
[]
[]
[]
[]
[]
[]
[]
[]
[]
[]
[]
[]
[]
[]
[]
[]
[]
[]
[]
[]
[]
[]
[]
[]
[]
[]
[]
[]
[]
[]
[]
[]
[]
[]
[]
[]
[]
[]
[]
[]
[]
[]
[]
[]
[]
[]
[]
[]
[]
[]
[]
[]
[]
[]
[]
[]
[]
[]
[]
[]
[]
[]
[]
[]
[]
[]
[]
[]
[]
[]
[]
[]
[]
[]
[]
[]
[]
[]
[]
[]
[]
[]
[]
[]
[]
[]
[]
[]
[]
[]
[]
[]
[]
[]
[]
[]
[]
[]
[]
[]
[]
[]
[]
[]
[]
[]
[]
[]
[]
[]
[]
[]
[]
[]
[]
[]
[]
[]
[]
[]
[]
[]
[]
[]
[]
[]
[]
[]
[]
[]
[]
[]
[]
[]
[]
[]
[]
[]
[]
[]
[]
[]
[]
[]
[]
[]
[]
[]
[]
[]
[]
[]
[]
[]
[]
[]
[]
[]
[]
[]
[]
[]
[]
[]
[]
[]
[]
[]
[]
[]
[]
[]
[]
[]
[]
[]
[]
[]
[]
[]
[]
[]
[]
[]
[]
[]
[]
[]
[]
[]
[]
[]
[]
[]
[]
[]
[]
[]
[]
[]
[]
[]
[]
[]
[]
[]
[]
[]
[]
[]
[]
[]
[]
[]
[]
[]
[]
[]
[]
[]
[]
[]
[]
[]
[]
[]
[]
[]
[]
[]
[]
[]
[]
[]
[]
[]
[]
[]
[]
[]
[]
[]
[]
[]
[]
[]
[]
[]
[]
[]
[]
[]
[]
[]
[]
[]
[]
[]
[]
[]
[]
[]
[]
[]
[]
[]
[]
[]
[]
[]
[]
[]
[]
[]
[]
[]
[]
[]
[]
[]
[]
[]
[]
[]
[]
[]
[]
[]
[]
[]
[]
[]
[]
[]
[]
[]
[]
[]
[]
[]
[]
[]
[]
[]
[]
[]
[]
[]
[]
[]
[]
[]
[]
[]
[]
[]
[]
[]
[]
[]
[]
[]
[]
[]
[]
[]
[]
[]
[]
[]
[]
[]
[]
[]
[]
[]
[]
[]
[]
[]
[]
[]
[]
[]
[]
[]
[]
[]
[]
[]
[]
[]
[]
[]
[]
[]
[]
[]
[]
[]
[]
[]
[]
[]
[]
[]
[]
[]
[]
[]
[]
[]
[]
[]
[]
[]
[]
[]
[]
[]
[]
[]
[]
[]
[]
[]
[]
[]
[]
[]
[]
[]
[]
[]
[]
[]
[]
[]
[]
[]
[]
[]
[]
[]
[]
[]
[]
[]
[]
[]
[]
[]
[]
[]
[]
[]
[]
[]
[]
[]
[]
[]
[]
[]
[]
[]
[]
[]
[]
[]
[]
[]
[]
[]
[]
[]
[]
[]
[]
[]
[]
[]
[]
[]
[]
[]
[]
[]
[]
[]
[]
[]
[]
[]
[]
[]
[]
[]
[]
[]
[]
[]
[]
[]
[]
[]
[]
[]
[]
[]
[]
[]
[]
[]
[]
[]
[]
[]
[]
[]
[]
[]
[]
[]
[]
[]
[]
[]
[]
[]
[]
[]
[]
[]
[]
[]
[]
[]
[]
[]
[]
[]
[]
[]
[]
[]
[]
[]
[]
[]
[]
[]
[]
[]
[]
[]
[]
[]
[]
[]
[]
[]
[]
[]
[]
[]
[]
[]
[]
[]
[]
[]
[]
[]
[]
[]
[]
[]
[]
[]
[]
[]
[]
[]
[]
[]
[]
[]
[]
[]
[]
[]
[]
[]
[]
[]
[]
[]
[]
[]
[]
[]
[]
[]
[]
[]
[]
[]
[]
[]
[]
[]
[]
[]
[]
[]
[]
[]
[]
[]
[]
[]
[]
[]
[]
[]
[]
[]
[]
[]
[]
[]
[]
[]
[]
[]
[]
[]
[]
[]
[]
[]
[]
[]
[]
[]
[]
[]
[]
[]
[]
[]
[]
[]
[]
[]
[]
[]
[]
[]
[]
[]
[]
[]
[]
[]
[]
[]
[]
[]
[]
[]
[]
[]
[]
[]
[]
[]
[]
[]
[]
[]
[]
[]
[]
[]
[]
[]
[]
[]
[]
[]
[]
[]
[]
[]
[]
[]
[]
[]
[]
[]
[]
[]
[]
[]
[]
[]
[]
[]
[]
[]
[]
[]
[]
[]
[]
[]
[]
[]
[]
[]
[]
[]
[]
[]
[]
[]
[]
[]
[]
[]
[]
[]
[]
[]
[]
[]
[]
[]
[]
[]
[]
[]
[]
[]
[]
[]
[]
[]
[]
[]
[]
[]
[]
[]
[]
[]
[]
[]
[]
[]
[]
[]
[]
[]
[]
[]
[]
[]
[]
[]
[]
[]
[]
[]
[]
[]
[]
[]
[]
[]
[]
[]
[]
[]
[]
[]
[]
[]
[]
[]
[]
[]
[]
[]
[]
[]
[]
[]
[]
[]
[]
[]
[]
[]
[]
[]
[]
[]
[]
[]
[]
[]
[]
[]
[]
[]
[]
[]
[]
[]
[]
[]
[]
[]
[]
[]
[]
[]
[]
[]
[]
[]
[]
[]
[]
[]
[]
[]
[]
[]
[]
[]
[]
[]
[]
[]
[]
[]
[]
[]
[]
[]
[]
[]
[]
[]
[]
[]
[]
[]
[]
[]
[]
[]
[]
[]
[]
[]
[]
[]
[]
[]
[]
[]
[]
[]
[]
[]
[]
[]
[]
[]
[]
[]
[]
[]
[]
[]
[]
[]
[]
[]
[]
[]
[]
[]
[]
[]
[]
[]
[]
[]
[]
[]
[]
[]
[]
[]
[]
[]
[]
[]
[]
[]
[]
[]
[]
[]
[]
[]
[]
[]
[]
[]
[]
[]
[]
[]
[]
[]
[]
[]
[]
[]
[]
[]
[]
[]
[]
[]
[]
[]
[]
[]
[]
[]
[]
[]
[]
[]
[]
[]
[]
[]
[]
[]
[]
[]
[]
[]
[]
[]
[]
[]
[]
[]
[]
[]
[]
[]
[]
[]
[]
[]
[]
[]
[]
[]
[]
[]
[]
[]
[]
[]
[]
[]
[]
[]
[]
[]
[]
[]
[]
[]
[]
[]
[]
[]
[]
[]
[]
[]
[]
[]
[]
[]
[]
[]
[]
[]
[]
[]
[]
[]
[]
[]
[]
[]
[]
[]
[]
[]
[]
[]
[]
[]
[]
[]
[]
[]
[]
[]
[]
[]
[]
[]
[]
[]
[]
[]
[]
[]
[]
[]
[]
[]
[]
[]
[]
[]
[]
[]
[]
[]
[]
[]
[]
[]
[]
[]
[]
[]
[]
[]
[]
[]
[]
[]
[]
[]
[]
[]
[]
[]
[]
[]
[]
[]
[]
[]
[]
[]
[]
[]
[]
[]
[]
[]
[]
[]
[]
[]
[]
[]
[]
[]
[]
[]
[]
[]
[]
[]
[]
[]
[]
[]
[]
[]
[]
[]
[]
[]
[]
[]
[]
[]
[]
[]
[]
[]
[]
[]
[]
[]
[]
[]
[]
[]
[]
[]
[]
[]
[]
[]
[]
[]
[]
[]
[]
[]
[]
[]
[]
[]
[]
[]
[]
[]
[]
[]
[]
[]
[]
[]
[]
[]
[]
[]
[]
[]
[]
[]
[]
[]
[]
[]
[]
[]
[]
[]
[]
[]
[]
[]
[]
[]
[]
[]
[]
[]
[]
[]
[]
[]
[]
[]
[]
[]
[]
[]
[]
[]
[]
[]
[]
[]
[]
[]
[]
[]
[]
[]
[]
[]
[]
[]
[]
[]
[]
[]
[]
[]
[]
[]
[]
[]
[]
[]
[]
[]
[]
[]
[]
[]
[]
[]
[]
[]
[]
[]
[]
[]
[]
[]
[]
[]
[]
[]
[]
[]
[]
[]
[]
[]
[]
[]
[]
[]
[]
[]
[]
[]
[]
[]
[]
[]
[]
[]
[]
[]
[]
[]
[]
[]
[]
[]
[]
[]
[]
[]
[]
[]
[]
[]
[]
[]
[]
[]
[]
[]
[]
[]
[]
[]
[]
[]
[]
[]
[]
[]
[]
[]
[]
[]
[]
[]
[]
[]
[]
[]
[]
[]
[]
[]
[]
[]
[]
[]
[]
[]
[]
[]
[]
[]
[]
[]
[]
[]
[]
[]
[]
[]
[]
[]
[]
[]
[]
[]
[]
[]
[]
[]
[]
[]
[]
[]
[]
[]
[]
[]
[]
[]
[]
[]
[]
[]
[]
[]
[]
[]
[]
[]
[]
[]
[]
[]
[]
[]
[]
[]
[]
[]
[]
[]
[]
[]
[]
[]
[]
[]
[]
[]
[]
[]
[]
[]
[]
[]
[]
[]
[]
[]
[]
[]
[]
[]
[]
[]
[]
[]
[]
[]
[]
[]
[]
[]
[]
[]
[]
[]
[]
[]
[]
[]
[]
[]
[]
[]
[]
[]
[]
[]
[]
[]
[]
[]
[]
[]
[]
[]
[]
[]
[]
[]
[]
[]
[]
[]
[]
[]
[]
[]
[]
[]
[]
[]
[]
[]
[]
[]
[]
[]
[]
[]
[]
[]
[]
[]
[]
[]
[]
[]
[]
[]
[]
[]
[]
[]
[]
[]
[]
[]
[]
[]
[]
[]
[]
[]
[]
[]
[]
[]
[]
[]
[]
[]
[]
[]
[]
[]
[]
[]
[]
[]
[]
[]
[]
[]
[]
[]
[]
[]
[]
[]
[]
[]
[]
[]
[]
[]
[]
[]
[]
[]
[]
[]
[]
[]
[]
[]
[]
[]
[]
[]
[]
[]
[]
[]
[]
[]
[]
[]
[]
[]
[]
[]
[]
[]
[]
[]
[]
[]
[]
[]
[]
[]
[]
[]
[]
[]
[]
[]
[]
[]
[]
[]
[]
[]
[]
[]
[]
[]
[]
[]
[]
[]
[]
[]
[]
[]
[]
[]
[]
[]
[]
[]
[]
[]
[]
[]
[]
[]
[]
[]
[]
[]
[]
[]
[]
[]
[]
[]
[]
[]
[]
[]
[]
[]
[]
[]
[]
[]
[]
[]
[]
[]
[]
[]
[]
[]
[]
[]
[]
[]
[]
[]
[]
[]
[]
[]
[]
[]
[]
[]
[]
[]
[]
[]
[]
[]
[]
[]
[]
[]
[]
[]
[]
[]
[]
[]
[]
[]
[]
[]
[]
[]
[]
[]
[]
[]
[]
[]
[]
[]
[]
[]
[]
[]
[]
[]
[]
[]
[]
[]
[]
[]
[]
[]
[]
[]
[]
[]
[]
[]
[]
[]
[]
[]
[]
[]
[]
[]
[]
[]
[]
[]
[]
[]
[]
[]
[]
[]
[]
[]
[]
[]
[]
[]
[]
[]
[]
[]
[]
[]
[]
[]
[]
[]
[]
[]
[]
[]
[]
[]
[]
[]
[]
[]
[]
[]
[]
[]
[]
[]
[]
[]
[]
[]
[]
[]
[]
[]
[]
[]
[]
[]
[]
[]
[]
[]
[]
[]
[]
[]
[]
[]
[]
[]
[]
[]
[]
[]
[]
[]
[]
[]
[]
[]
[]
[]
[]
[]
[]
[]
[]
[]
[]
[]
[]
[]
[]
[]
[]
[]
[]
[]
[]
[]
[]
[]
[]
[]
[]
[]
[]
[]
[]
[]
[]
[]
[]
[]
[]
[]
[]
[]
[]
[]
[]
[]
[]
[]
[]
[]
[]
[]
[]
[]
[]
[]
[]
[]
[]
[]
[]
[]
[]
[]
[]
[]
[]
[]
[]
[]
[]
[]
[]
[]
[]
[]
[]
[]
[]
[]
[]
[]
[]
[]
[]
[]
[]
[]
[]
[]
[]
[]
[]
[]
[]
[]
[]
[]
[]
[]
[]
[]
[]
[]
[]
[]
[]
[]
[]
[]
[]
[]
[]
[]
[]
[]
[]
[]
[]
[]
[]
[]
[]
[]
[]
[]
[]
[]
[]
[]
[]
[]
[]
[]
[]
[]
[]
[]
[]
[]
[]
[]
[]
[]
[]
[]
[]
[]
[]
[]
[]
[]
[]
[]
[]
[]
[]
[]
[]
[]
[]
[]
[]
[]
[]
[]
[]
[]
[]
[]
[]
[]
[]
[]
[]
[]
[]
[]
[]
[]
[]
[]
[]
[]
[]
[]
[]
[]
[]
[]
[]
[]
[]
[]
[]
[]
[]
[]
[]
[]
[]
[]
[]
[]
[]
[]
[]
[]
[]
[]
[]
[]
[]
[]
[]
[]
[]
[]
[]
[]
[]
[]
[]
[]
[]
[]
[]
[]
[]
[]
[]
[]
[]
[]
[]
[]
[]
[]
[]
[]
[]
[]
[]
[]
[]
[]
[]
[]
[]
[]
[]
[]
[]
[]
[]
[]
[]
[]
[]
[]
[]
[]
[]
[]
[]
[]
[]
[]
[]
[]
[]
[]
[]
[]
[]
[]
[]
[]
[]
[]
[]
[]
[]
[]
[]
[]
[]
[]
[]
[]
[]
[]
[]
[]
[]
[]
[]
[]
[]
[]
[]
[]
[]
[]
[]
[]
[]
[]
[]
[]
[]
[]
[]
[]
[]
[]
[]
[]
[]
[]
[]
[]
[]
[]
[]
[]
[]
[]
[]
[]
[]
[]
[]
[]
[]
[]
[]
[]
[]
[]
[]
[]
[]
[]
[]
[]
[]
[]
[]
[]
[]
[]
[]
[]
[]
[]
[]
[]
[]
[]
[]
[]
[]
[]
[]
[]
[]
[]
[]
[]
[]
[]
[]
[]
[]
[]
[]
[]
[]
[]
[]
[]
[]
[]
[]
[]
[]
[]
[]
[]
[]
[]
[]
[]
[]
[]
[]
[]
[]
[]
[]
[]
[]
[]
[]
[]
[]
[]
[]
[]
[]
[]
[]
[]
[]
[]
[]
[]
[]
[]
[]
[]
[]
[]
[]
[]
[]
[]
[]
[]
[]
[]
[]
[]
[]
[]
[]
[]
[]
[]
[]
[]
[]
[]
[]
[]
[]
[]
[]
[]
[]
[]
[]
[]
[]
[]
[]
[]
[]
[]
[]
[]
[]
[]
[]
[]
[]
[]
[]
[]
[]
[]
[]
[]
[]
[]
[]
[]
[]
[]
[]
[]
[]
[]
[]
[]
[]
[]
[]
[]
[]
[]
[]
[]
[]
[]
[]
[]
[]
[]
[]
[]
[]
[]
[]
[]
[]
[]
[]
[]
[]
[]
[]
[]
[]
[]
[]
[]
[]
[]
[]
[]
[]
[]
[]
[]
[]
[]
[]
[]
[]
[]
[]
[]
[]
[]
[]
[]
[]
[]
[]
[]
[]
[]
[]
[]
[]
[]
[]
[]
[]
[]
[]
[]
[]
[]
[]
[]
[]
[]
[]
[]
[]
[]
[]
[]
[]
[]
[]
[]
[]
[]
[]
[]
[]
[]
[]
[]
[]
[]
[]
[]
[]
[]
[]
[]
[]
[]
[]
[]
[]
[]
[]
[]
[]
[]
[]
[]
[]
[]
[]
[]
[]
[]
[]
[]
[]
[]
[]
[]
[]
[]
[]
[]
[]
[]
[]
[]
[]
[]
[]
[]
[]
[]
[]
[]
[]
[]
[]
[]
[]
[]
[]
[]
[]
[]
[]
[]
[]
[]
[]
[]
[]
[]
[]
[]
[]
[]
[]
[]
[]
[]
[]
[]
[]
[]
[]
[]
[]
[]
[]
[]
[]
[]
[]
[]
[]
[]
[]
[]
[]
[]
[]
[]
[]
[]
[]
[]
[]
[]
[]
[]
[]
[]
[]
[]
[]
[]
[]
[]
[]
[]
[]
[]
[]
[]
[]
[]
[]
[]
[]
[]
[]
[]
[]
[]
[]
[]
[]
[]
[]
[]
[]
[]
[]
[]
[]
[]
[]
[]
[]
[]
[]
[]
[]
[]
[]
[]
[]
[]
[]
[]
[]
[]
[]
[]
[]
[]
[]
[]
[]
[]
[]
[]
[]
[]
[]
[]
[]
[]
[]
[]
[]
[]
[]
[]
[]
[]
[]
[]
[]
[]
[]
[]
[]
[]
[]
[]
[]
[]
[]
[]
[]
[]
[]
[]
[]
[]
[]
[]
[]
[]
[]
[]
[]
[]
[]
[]
[]
[]
[]
[]
[]
[]
[]
[]
[]
[]
[]
[]
[]
[]
[]
[]
[]
[]
[]
[]
[]
[]
[]
[]
[]
[]
[]
[]
[]
[]
[]
[]
[]
[]
[]
[]
[]
[]
[]
[]
[]
[]
[]
[]
[]
[]
[]
[]
[]
[]
[]
[]
[]
[]
[]
[]
[]
[]
[]
[]
[]
[]
[]
[]
[]
[]
[]
[]
[]
[]
[]
[]
[]
[]
[]
[]
[]
[]
[]
[]
[]
[]
[]
[]
[]
[]
[]
[]
[]
[]
[]
[]
[]
[]
[]
[]
[]
[]
[]
[]
[]
[]
[]
[]
[]
[]
[]
[]
[]
[]
[]
[]
[]
[]
[]
[]
[]
[]
[]
[]
[]
[]
[]
[]
[]
[]
[]
[]
[]
[]
[]
[]
[]
[]
[]
[]
[]
[]
[]
[]
[]
[]
[]
[]
[]
[]
[]
[]
[]
[]
[]
[]
[]
[]
[]
[]
[]
[]
[]
[]
[]
[]
[]
[]
[]
[]
[]
[]
[]
[]
[]
[]
[]
[]
[]
[]
[]
[]
[]
[]
[]
[]
[]
[]
[]
[]
[]
[]
[]
[]
[]
[]
[]
[]
[]
[]
[]
[]
[]
[]
[]
[]
[]
[]
[]
[]
[]
[]
[]
[]
[]
[]
[]
[]
[]
[]
[]
[]
[]
[]
[]
[]
[]
[]
[]
[]
[]
[]
[]
[]
[]
[]
[]
[]
[]
[]
[]
[]
[]
[]
[]
[]
[]
[]
[]
[]
[]
[]
[]
[]
[]
[]
[]
[]
[]
[]
[]
[]
[]
[]
[]
[]
[]
[]
[]
[]
[]
[]
[]
[]
[]
[]
[]
[]
[]
[]
[]
[]
[]
[]
[]
[]
[]
[]
[]
[]
[]
[]
[]
[]
[]
[]
[]
[]
[]
[]
[]
[]
[]
[]
[]
[]
[]
[]
[]
[]
[]
[]
[]
[]
[]
[]
[]
[]
[]
[]
[]
[]
[]
[]
[]
[]
[]
[]
[]
[]
[]
[]
[]
[]
[]
[]
[]
[]
[]
[]
[]
[]
[]
[]
[]
[]
[]
[]
[]
[]
[]
[]
[]
[]
[]
[]
[]
[]
[]
[]
[]
[]
[]
[]
[]
[]
[]
[]
[]
[]
[]
[]
[]
[]
[]
[]
[]
[]
[]
[]
[]
[]
[]
[]
[]
[]
[]
[]
[]
[]
[]
[]
[]
[]
[]
[]
[]
[]
[]
[]
[]
[]
[]
[]
[]
[]
[]
[]
[]
[]
[]
[]
[]
[]
[]
[]
[]
[]
[]
[]
[]
[]
[]
[]
[]
[]
[]
[]
[]
[]
[]
[]
[]
[]
[]
[]
[]
[]
[]
[]
[]
[]
[]
[]
[]
[]
[]
[]
[]
[]
[]
[]
[]
[]
[]
[]
[]
[]
[]
[]
[]
[]
[]
[]
[]
[]
[]
[]
[]
[]
[]
[]
[]
[]
[]
[]
[]
[]
[]
[]
[]
[]
[]
[]
[]
[]
[]
[]
[]
[]
[]
[]
[]
[]
[]
[]
[]
[]
[]
[]
[]
[]
[]
[]
[]
[]
[]
[]
[]
[]
[]
[]
[]
[]
[]
[]
[]
[]
[]
[]
[]
[]
[]
[]
[]
[]
[]
[]
[]
[]
[]
[]
[]
[]
[]
[]
[]
[]
[]
[]
[]
[]
[]
[]
[]
[]
[]
[]
[]
[]
[]
[]
[]
[]
[]
[]
[]
[]
[]
[]
[]
[]
[]
[]
[]
[]
[]
[]
[]
[]
[]
[]
[]
[]
[]
[]
[]
[]
[]
[]
[]
[]
[]
[]
[]
[]
[]
[]
[]
[]
[]
[]
[]
[]
[]
[]
[]
[]
[]
[]
[]
[]
[]
[]
[]
[]
[]
[]
[]
[]
[]
[]
[]
[]
[]
[]
[]
[]
[]
[]
[]
[]
[]
[]
[]
[]
[]
[]
[]
[]
[]
[]
[]
[]
[]
[]
[]
[]
[]
[]
[]
[]
[]
[]
[]
[]
[]
[]
[]
[]
[]
[]
[]
[]
[]
[]
[]
[]
[]
[]
[]
[]
[]
[]
[]
[]
[]
[]
[]
[]
[]
[]
[]
[]
[]
[]
[]
[]
[]
[]
[]
[]
[]
[]
[]
[]
[]
[]
[]
[]
[]
[]
[]
[]
[]
[]
[]
[]
[]
[]
[]
[]
[]
[]
[]
[]
[]
[]
[]
[]
[]
[]
[]
[]
[]
[]
[]
[]
[]
[]
[]
[]
[]
[]
[]
[]
[]
[]
[]
[]
[]
[]
[]
[]
[]
[]
[]
[]
[]
[]
[]
[]
[]
[]
[]
[]
[]
[]
[]
[]
[]
[]
[]
[]
[]
[]
[]
[]
[]
[]
[]
[]
[]
[]
[]
[]
[]
[]
[]
[]
[]
[]
[]
[]
[]
[]
[]
[]
[]
[]
[]
[]
[]
[]
[]
[]
[]
[]
[]
[]
[]
[]
[]
[]
[]
[]
[]
[]
[]
[]
[]
[]
[]
[]
[]
[]
[]
[]
[]
[]
[]
[]
[]
[]
[]
[]
[]
[]
[]
[]
[]
[]
[]
[]
[]
[]
[]
[]
[]
[]
[]
[]
[]
[]
[]
[]
[]
[]
[]
[]
[]
[]
[]
[]
[]
[]
[]
[]
[]
[]
[]
[]
[]
[]
[]
[]
[]
[]
[]
[]
[]
[]
[]
[]
[]
[]
[]
[]
[]
[]
[]
[]
[]
[]
[]
[]
[]
[]
[]
[]
[]
[]
[]
[]
[]
[]
[]
[]
[]
[]
[]
[]
[]
[]
[]
[]
[]
[]
[]
[]
[]
[]
[]
[]
[]
[]
[]
[]
[]
[]
[]
[]
[]
[]
[]
[]
[]
[]
[]
[]
[]
[]
[]
[]
[]
[]
[]
[]
[]
[]
[]
[]
[]
[]
[]
[]
[]
[]
[]
[]
[]
[]
[]
[]
[]
[]
[]
[]
[]
[]
[]
[]
[]
[]
[]
[]
[]
[]
[]
[]
[]
[]
[]
[]
[]
[]
[]
[]
[]
[]
[]
[]
[]
[]
[]
[]
[]
[]
[]
[]
[]
[]
[]
[]
[]
[]
[]
[]
[]
[]
[]
[]
[]
[]
[]
[]
[]
[]
[]
[]
[]
[]
[]
[]
[]
[]
[]
[]
[]
[]
[]
[]
[]
[]
[]
[]
[]
[]
[]
[]
[]
[]
[]
[]
[]
[]
[]
[]
[]
[]
[]
[]
[]
[]
[]
[]
[]
[]
[]
[]
[]
[]
[]
[]
[]
[]
[]
[]
[]
[]
[]
[]
[]
[]
[]
[]
[]
[]
[]
[]
[]
[]
[]
[]
[]
[]
[]
[]
[]
[]
[]
[]
[]
[]
[]
[]
[]
[]
[]
[]
[]
[]
[]
[]
[]
[]
[]
[]
[]
[]
[]
[]
[]
[]
[]
[]
[]
[]
[]
[]
[]
[]
[]
[]
[]
[]
[]
[]
[]
[]
[]
[]
[]
[]
[]
[]
[]
[]
[]
[]
[]
[]
[]
[]
[]
[]
[]
[]
[]
[]
[]
[]
[]
[]
[]
[]
[]
[]
[]
[]
[]
[]
[]
[]
[]
[]
[]
[]
[]
[]
[]
[]
[]
[]
[]
[]
[]
[]
[]
[]
[]
[]
[]
[]
[]
[]
[]
[]
[]
[]
[]
[]
[]
[]
[]
[]
[]
[]
[]
[]
[]
[]
[]
[]
[]
[]
[]
[]
[]
[]
[]
[]
[]
[]
[]
[]
[]
[]
[]
[]
[]
[]
[]
[]
[]
[]
[]
[]
[]
[]
[]
[]
[]
[]
[]
[]
[]
[]
[]
[]
[]
[]
[]
[]
[]
[]
[]
[]
[]
[]
[]
[]
[]
[]
[]
[]
[]
[]
[]
[]
[]
[]
[]
[]
[]
[]
[]
[]
[]
[]
[]
[]
[]
[]
[]
[]
[]
[]
[]
[]
[]
[]
[]
[]
[]
[]
[]
[]
[]
[]
[]
[]
[]
[]
[]
[]
[]
[]
[]
[]
[]
[]
[]
[]
[]
[]
[]
[]
[]
[]
[]
[]
[]
[]
[]
[]
[]
[]
[]
[]
[]
[]
[]
[]
[]
[]
[]
[]
[]
[]
[]
[]
[]
[]
[]
[]
[]
[]
[]
[]
[]
[]
[]
[]
[]
[]
[]
[]
[]
[]
[]
[]
[]
[]
[]
[]
[]
[]
[]
[]
[]
[]
[]
[]
[]
[]
[]
[]
[]
[]
[]
[]
[]
[]
[]
[]
[]
[]
[]
[]
[]
[]
[]
[]
[]
[]
[]
[]
[]
[]
[]
[]
[]
[]
[]
[]
[]
[]
[]
[]
[]
[]
[]
[]
[]
[]
[]
[]
[]
[]
[]
[]
[]
[]
[]
[]
[]
[]
[]
[]
[]
[]
[]
[]
[]
[]
[]
[]
[]
[]
[]
[]
[]
[]
[]
[]
[]
[]
[]
[]
[]
[]
[]
[]
[]
[]
[]
[]
[]
[]
[]
[]
[]
[]
[]
[]
[]
[]
[]
[]
[]
[]
[]
[]
[]
[]
[]
[]
[]
[]
[]
[]
[]
[]
[]
[]
[]
[]
[]
[]
[]
[]
[]
[]
[]
[]
[]
[]
[]
[]
[]
[]
[]
[]
[]
[]
[]
[]
[]
[]
[]
[]
[]
[]
[]
[]
[]
[]
[]
[]
[]
[]
[]
[]
[]
[]
[]
[]
[]
[]
[]
[]
[]
[]
[]
[]
[]
[]
[]
[]
[]
[]
[]
[]
[]
[]
[]
[]
[]
[]
[]
[]
[]
[]
[]
[]
[]
[]
[]
[]
[]
[]
[]
[]
[]
[]
[]
[]
[]
[]
[]
[]
[]
[]
[]
[]
[]
[]
[]
[]
[]
[]
[]
[]
[]
[]
[]
[]
[]
[]
[]
[]
[]
[]
[]
[]
[]
[]
[]
[]
[]
[]
[]
[]
[]
[]
[]
[]
[]
[]
[]
[]
[]
[]
[]
[]
[]
[]
[]
[]
[]
[]
[]
[]
[]
[]
[]
[]
[]
[]
[]
[]
[]
[]
[]
[]
[]
[]
[]
[]
[]
[]
[]
[]
[]
[]
[]
[]
[]
[]
[]
[]
[]
[]
[]
[]
[]
[]
[]
[]
[]
[]
[]
[]
[]
[]
[]
[]
[]
[]
[]
[]
[]
[]
[]
[]
[]
[]
[]
[]
[]
[]
[]
[]
[]
[]
[]
[]
[]
[]
[]
[]
[]
[]
[]
[]
[]
[]
[]
[]
[]
[]
[]
[]
[]
[]
[]
[]
[]
[]
[]
[]
[]
[]
[]
[]
[]
[]
[]
[]
[]
[]
[]
[]
[]
[]
[]
[]
[]
[]
[]
[]
[]
[]
[]
[]
[]
[]
[]
[]
[]
[]
[]
[]
[]
[]
[]
[]
[]
[]
[]
[]
[]
[]
[]
[]
[]
[]
[]
[]
[]
[]
[]
[]
[]
[]
[]
[]
[]
[]
[]
[]
[]
[]
[]
[]
[]
[]
[]
[]
[]
[]
[]
[]
[]
[]
[]
[]
[]
[]
[]
[]
[]
[]
[]
[]
[]
[]
[]
[]
[]
[]
[]
[]
[]
[]
[]
[]
[]
[]
[]
[]
[]
[]
[]
[]
[]
[]
[]
[]
[]
[]
[]
[]
[]
[]
[]
[]
[]
[]
[]
[]
[]
[]
[]
[]
[]
[]
[]
[]
[]
[]
[]
[]
[]
[]
[]
[]
[]
[]
[]
[]
[]
[]
[]
[]
[]
[]
[]
[]
[]
[]
[]
[]
[]
[]
[]
[]
[]
[]
[]
[]
[]
[]
[]
[]
[]
[]
[]
[]
[]
[]
[]
[]
[]
[]
[]
[]
[]
[]
[]
[]
[]
[]
[]
[]
[]
[]
[]
[]
[]
[]
[]
[]
[]
[]
[]
[]
[]
[]
[]
[]
[]
[]
[]
[]
[]
[]
[]
[]
[]
[]
[]
[]
[]
[]
[]
[]
[]
[]
[]
[]
[]
[]
[]
[]
[]
[]
[]
[]
[]
[]
[]
[]
[]
[]
[]
[]
[]
[]
[]
[]
[]
[]
[]
[]
[]
[]
[]
[]
[]
[]
[]
[]
[]
[]
[]
[]
[]
[]
[]
[]
[]
[]
[]
[]
[]
[]
[]
[]
[]
[]
[]
[]
[]
[]
[]
[]
[]
[]
[]
[]
[]
[]
[]
[]
[]
[]
[]
[]
[]
[]
[]
[]
[]
[]
[]
[]
[]
[]
[]
[]
[]
[]
[]
[]
[]
[]
[]
[]
[]
[]
[]
[]
[]
[]
[]
[]
[]
[]
[]
[]
[]
[]
[]
[]
[]
[]
[]
[]
[]
[]
[]
[]
[]
[]
[]
[]
[]
[]
[]
[]
[]
[]
[]
[]
[]
[]
[]
[]
[]
[]
[]
[]
[]
[]
[]
[]
[]
[]
[]
[]
[]
[]
[]
[]
[]
[]
[]
[]
[]
[]
[]
[]
[]
[]
[]
[]
[]
[]
[]
[]
[]
[]
[]
[]
[]
[]
[]
[]
[]
[]
[]
[]
[]
[]
[]
[]
[]
[]
[]
[]
[]
[]
[]
[]
[]
[]
[]
[]
[]
[]
[]
[]
[]
[]
[]
[]
[]
[]
[]
[]
[]
[]
[]
[]
[]
[]
[]
[]
[]
[]
[]
[]
[]
[]
[]
[]
[]
[]
[]
[]
[]
[]
[]
[]
[]
[]
[]
[]
[]
[]
[]
[]
[]
[]
[]
[]
[]
[]
[]
[]
[]
[]
[]
[]
[]
[]
[]
[]
[]
[]
[]
[]
[]
[]
[]
[]
[]
[]
[]
[]
[]
[]
[]
[]
[]
[]
[]
[]
[]
[]
[]
[]
[]
[]
[]
[]
[]
[]
[]
[]
[]
[]
[]
[]
[]
[]
[]
[]
[]
[]
[]
[]
[]
[]
[]
[]
[]
[]
[]
[]
[]
[]
[]
[]
[]
[]
[]
[]
[]
[]
[]
[]
[]
[]
[]
[]
[]
[]
[]
[]
[]
[]
[]
[]
[]
[]
[]
[]
[]
[]
[]
[]
[]
[]
[]
[]
[]
[]
[]
[]
[]
[]
[]
[]
[]
[]
[]
[]
[]
[]
[]
[]
[]
[]
[]
[]
[]
[]
[]
[]
[]
[]
[]
[]
[]
[]
[]
[]
[]
[]
[]
[]
[]
[]
[]
[]
[]
[]
[]
[]
[]
[]
[]
[]
[]
[]
[]
[]
[]
[]
[]
[]
[]
[]
[]
[]
[]
[]
[]
[]
[]
[]
[]
[]
[]
[]
[]
[]
[]
[]
[]
[]
[]
[]
[]
[]
[]
[]
[]
[]
[]
[]
[]
[]
[]
[]
[]
[]
[]
[]
[]
[]
[]
[]
[]
[]
[]
[]
[]
[]
[]
[]
[]
[]
[]
[]
[]
[]
[]
[]
[]
[]
[]
[]
[]
[]
[]
[]
[]
[]
[]
[]
[]
[]
[]
[]
[]
[]
[]
[]
[]
[]
[]
[]
[]
[]
[]
[]
[]
[]
[]
[]
[]
[]
[]
[]
[]
[]
[]
[]
[]
[]
[]
[]
[]
[]
[]
[]
[]
[]
[]
[]
[]
[]
[]
[]
[]
[]
[]
[]
[]
[]
[]
[]
[]
[]
[]
[]
[]
[]
[]
[]
[]
[]
[]
[]
[]
[]
[]
[]
[]
[]
[]
[]
[]
[]
[]
[]
[]
[]
[]
[]
[]
[]
[]
[]
[]
[]
[]
[]
[]
[]
[]
[]
[]
[]
[]
[]
[]
[]
[]
[]
[]
[]
[]
[]
[]
[]
[]
[]
[]
[]
[]
[]
[]
[]
[]
[]
[]
[]
[]
[]
[]
[]
[]
[]
[]
[]
[]
[]
[]
[]
[]
[]
[]
[]
[]
[]
[]
[]
[]
[]
[]
[]
[]
[]
[]
[]
[]
[]
[]
[]
[]
[]
[]
[]
[]
[]
[]
[]
[]
[]
[]
[]
[]
[]
[]
[]
[]
[]
[]
[]
[]
[]
[]
[]
[]
[]
[]
[]
[]
[]
[]
[]
[]
[]
[]
[]
[]
[]
[]
[]
[]
[]
[]
[]
[]
[]
[]
[]
[]
[]
[]
[]
[]
[]
[]
[]
[]
[]
[]
[]
[]
[]
[]
[]
[]
[]
[]
[]
[]
[]
[]
[]
[]
[]
[]
[]
[]
[]
[]
[]
[]
[]
[]
[]
[]
[]
[]
[]
[]
[]
[]
[]
[]
[]
[]
[]
[]
[]
[]
[]
[]
[]
[]
[]
[]
[]
[]
[]
[]
[]
[]
[]
[]
[]
[]
[]
[]
[]
[]
[]
[]
[]
[]
[]
[]
[]
[]
[]
[]
[]
[]
[]
[]
[]
[]
[]
[]
[]
[]
[]
[]
[]
[]
[]
[]
[]
[]
[]
[]
[]
[]
[]
[]
[]
[]
[]
[]
[]
[]
[]
[]
[]
[]
[]
[]
[]
[]
[]
[]
[]
[]
[]
[]
[]
[]
[]
[]
[]
[]
[]
[]
[]
[]
[]
[]
[]
[]
[]
[]
[]
[]
[]
[]
[]
[]
[]
[]
[]
[]
[]
[]
[]
[]
[]
[]
[]
[]
[]
[]
[]
[]
[]
[]
[]
[]
[]
[]
[]
[]
[]
[]
[]
[]
[]
[]
[]
[]
[]
[]
[]
[]
[]
[]
[]
[]
[]
[]
[]
[]
[]
[]
[]
[]
[]
[]
[]
[]
[]
[]
[]
[]
[]
[]
[]
[]
[]
[]
[]
[]
[]
[]
[]
[]
[]
[]
[]
[]
[]
[]
[]
[]
[]
[]
[]
[]
[]
[]
[]
[]
[]
[]
[]
[]
[]
[]
[]
[]
[]
[]
[]
[]
[]
[]
[]
[]
[]
[]
[]
[]
[]
[]
[]
[]
[]
[]
[]
[]
[]
[]
[]
[]
[]
[]
[]
[]
[]
[]
[]
[]
[]
[]
[]
[]
[]
[]
[]
[]
[]
[]
[]
[]
[]
[]
[]
[]
[]
[]
[]
[]
[]
[]
[]
[]
[]
[]
[]
[]
[]
[]
[]
[]
[]
[]
[]
[]
[]
[]
[]
[]
[]
[]
[]
[]
[]
[]
[]
[]
[]
[]
[]
[]
[]
[]
[]
[]
[]
[]
[]
[]
[]
[]
[]
[]
[]
[]
[]
[]
[]
[]
[]
[]
[]
[]
[]
[]
[]
[]
[]
[]
[]
[]
[]
[]
[]
[]
[]
[]
[]
[]
[]
[]
[]
[]
[]
[]
[]
[]
[]
[]
[]
[]
[]
[]
[]
[]
[]
[]
[]
[]
[]
[]
[]
[]
[]
[]
[]
[]
[]
[]
[]
[]
[]
[]
[]
[]
[]
[]
[]
[]
[]
[]
[]
[]
[]
[]
[]
[]
[]
[]
[]
[]
[]
[]
[]
[]
[]
[]
[]
[]
[]
[]
[]
[]
[]
[]
[]
[]
[]
[]
[]
[]
[]
[]
[]
[]
[]
[]
[]
[]
[]
[]
[]
[]
[]
[]
[]
[]
[]
[]
[]
[]
[]
[]
[]
[]
[]
[]
[]
[]
[]
[]
[]
[]
[]
[]
[]
[]
[]
[]
[]
[]
[]
[]
[]
[]
[]
[]
[]
[]
[]
[]
[]
[]
[]
[]
[]
[]
[]
[]
[]
[]
[]
[]
[]
[]
[]
[]
[]
[]
[]
[]
[]
[]
[]
[]
[]
[]
[]
[]
[]
[]
[]
[]
[]
[]
[]
[]
[]
[]
[]
[]
[]
[]
[]
[]
[]
[]
[]
[]
[]
[]
[]
[]
[]
[]
[]
[]
[]
[]
[]
[]
[]
[]
[]
[]
[]
[]
[]
[]
[]
[]
[]
[]
[]
[]
[]
[]
[]
[]
[]
[]
[]
[]
[]
[]
[]
[]
[]
[]
[]
[]
[]
[]
[]
[]
[]
[]
[]
[]
[]
[]
[]
[]
[]
[]
[]
[]
[]
[]
[]
[]
[]
[]
[]
[]
[]
[]
[]
[]
[]
[]
[]
[]
[]
[]
[]
[]
[]
[]
[]
[]
[]
[]
[]
[]
[]
[]
[]
[]
[]
[]
[]
[]
[]
[]
[]
[]
[]
[]
[]
[]
[]
[]
[]
[]
[]
[]
[]
[]
[]
[]
[]
[]
[]
[]
[]
[]
[]
[]
[]
[]
[]
[]
[]
[]
[]
[]
[]
[]
[]
[]
[]
[]
[]
[]
[]
[]
[]
[]
[]
[]
[]
[]
[]
[]
[]
[]
[]
[]
[]
[]
[]
[]
[]
[]
[]
[]
[]
[]
[]
[]
[]
[]
[]
[]
[]
[]
[]
[]
[]
[]
[]
[]
[]
[]
[]
[]
[]
[]
[]
[]
[]
[]
[]
[]
[]
[]
[]
[]
[]
[]
[]
[]
[]
[]
[]
[]
[]
[]
[]
[]
[]
[]
[]
[]
[]
[]
[]
[]
[]
[]
[]
[]
[]
[]
[]
[]
[]
[]
[]
[]
[]
[]
[]
[]
[]
[]
[]
[]
[]
[]
[]
[]
[]
[]
[]
[]
[]
[]
[]
[]
[]
[]
[]
[]
[]
[]
[]
[]
[]
[]
[]
[]
[]
[]
[]
[]
[]
[]
[]
[]
[]
[]
[]
[]
[]
[]
[]
[]
[]
[]
[]
[]
[]
[]
[]
[]
[]
[]
[]
[]
[]
[]
[]
[]
[]
[]
[]
[]
[]
[]
[]
[]
[]
[]
[]
[]
[]
[]
[]
[]
[]
[]
[]
[]
[]
[]
[]
[]
[]
[]
[]
[]
[]
[]
[]
[]
[]
[]
[]
[]
[]
[]
[]
[]
[]
[]
[]
[]
[]
[]
[]
[]
[]
[]
[]
[]
[]
[]
[]
[]
[]
[]
[]
[]
[]
[]
[]
[]
[]
[]
[]
[]
[]
[]
[]
[]
[]
[]
[]
[]
[]
[]
[]
[]
[]
[]
[]
[]
[]
[]
[]
[]
[]
[]
[]
[]
[]
[]
[]
[]
[]
[]
[]
[]
[]
[]
[]
[]
[]
[]
[]
[]
[]
[]
[]
[]
[]
[]
[]
[]
[]
[]
[]
[]
[]
[]
[]
[]
[]
[]
[]
[]
[]
[]
[]
[]
[]
[]
[]
[]
[]
[]
[]
[]
[]
[]
[]
[]
[]
[]
[]
[]
[]
[]
[]
[]
[]
[]
[]
[]
[]
[]
[]
[]
[]
[]
[]
[]
[]
[]
[]
[]
[]
[]
[]
[]
[]
[]
[]
[]
[]
[]
[]
[]
[]
[]
[]
[]
[]
[]
[]
[]
[]
[]
[]
[]
[]
[]
[]
[]
[]
[]
[]
[]
[]
[]
[]
[]
[]
[]
[]
[]
[]
[]
[]
[]
[]
[]
[]
[]
[]
[]
[]
[]
[]
[]
[]
[]
[]
[]
[]
[]
[]
[]
[]
[]
[]
[]
[]
[]
[]
[]
[]
[]
[]
[]
[]
[]
[]
[]
[]
[]
[]
[]
[]
[]
[]
[]
[]
[]
[]
[]
[]
[]
[]
[]
[]
[]
[]
[]
[]
[]
[]
[]
[]
[]
[]
[]
[]
[]
[]
[]
[]
[]
[]
[]
[]
[]
[]
[]
[]
[]
[]
[]
[]
[]
[]
[]
[]
[]
[]
[]
[]
[]
[]
[]
[]
[]
[]
[]
[]
[]
[]
[]
[]
[]
[]
[]
[]
[]
[]
[]
[]
[]
[]
[]
[]
[]
[]
[]
[]
[]
[]
[]
[]
[]
[]
[]
[]
[]
[]
[]
[]
[]
[]
[]
[]
[]
[]
[]
[]
[]
[]
[]
[]
[]
[]
[]
[]
[]
[]
[]
[]
[]
[]
[]
[]
[]
[]
[]
[]
[]
[]
[]
[]
[]
[]
[]
[]
[]
[]
[]
[]
[]
[]
[]
[]
[]
[]
[]
[]
[]
[]
[]
[]
[]
[]
[]
[]
[]
[]
[]
[]
[]
[]
[]
[]
[]
[]
[]
[]
[]
[]
[]
[]
[]
[]
[]
[]
[]
[]
[]
[]
[]
[]
[]
[]
[]
[]
[]
[]
[]
[]
[]
[]
[]
[]
[]
[]
[]
[]
[]
[]
[]
[]
[]
[]
[]
[]
[]
[]
[]
[]
[]
[]
[]
[]
[]
[]
[]
[]
[]
[]
[]
[]
[]
[]
[]
[]
[]
[]
[]
[]
[]
[]
[]
[]
[]
[]
[]
[]
[]
[]
[]
[]
[]
[]
[]
[]
[]
[]
[]
[]
[]
[]
[]
[]
[]
[]
[]
[]
[]
[]
[]
[]
[]
[]
[]
[]
[]
[]
[]
[]
[]
[]
[]
[]
[]
[]
[]
[]
[]
[]
[]
[]
[]
[]
[]
[]
[]
[]
[]
[]
[]
[]
[]
[]
[]
[]
[]
[]
[]
[]
[]
[]
[]
[]
[]
[]
[]
[]
[]
[]
[]
[]
[]
[]
[]
[]
[]
[]
[]
[]
[]
[]
[]
[]
[]
[]
[]
[]
[]
[]
[]
[]
[]
[]
[]
[]
[]
[]
[]
[]
[]
[]
[]
[]
[]
[]
[]
[]
[]
[]
[]
[]
[]
[]
[]
[]
[]
[]
[]
[]
[]
[]
[]
[]
[]
[]
[]
[]
[]
[]
[]
[]
[]
[]
[]
[]
[]
[]
[]
[]
[]
[]
[]
[]
[]
[]
[]
[]
[]
[]
[]
[]
[]
[]
[]
[]
[]
[]
[]
[]
[]
[]
[]
[]
[]
[]
[]
[]
[]
[]
[]
[]
[]
[]
[]
[]
[]
[]
[]
[]
[]
[]
[]
[]
[]
[]
[]
[]
[]
[]
[]
[]
[]
[]
[]
[]
[]
[]
[]
[]
[]
[]
[]
[]
[]
[]
[]
[]
[]
[]
[]
[]
[]
[]
[]
[]
[]
[]
[]
[]
[]
[]
[]
[]
[]
[]
[]
[]
[]
[]
[]
[]
[]
[]
[]
[]
[]
[]
[]
[]
[]
[]
[]
[]
[]
[]
[]
[]
[]
[]
[]
[]
[]
[]
[]
[]
[]
[]
[]
[]
[]
[]
[]
[]
[]
[]
[]
[]
[]
[]
[]
[]
[]
[]
[]
[]
[]
[]
[]
[]
[]
[]
[]
[]
[]
[]
[]
[]
[]
[]
[]
[]
[]
[]
[]
[]
[]
[]
[]
[]
[]
[]
[]
[]
[]
[]
[]
[]
[]
[]
[]
[]
[]
[]
[]
[]
[]
[]
[]
[]
[]
[]
[]
[]
[]
[]
[]
[]
[]
[]
[]
[]
[]
[]
[]
[]
[]
[]
[]
[]
[]
[]
[]
[]
[]
[]
[]
[]
[]
[]
[]
[]
[]
[]
[]
[]
[]
[]
[]
[]
[]
[]
[]
[]
[]
[]
[]
[]
[]
[]
[]
[]
[]
[]
[]
[]
[]
[]
[]
[]
[]
[]
[]
[]
[]
[]
[]
[]
[]
[]
[]
[]
[]
[]
[]
[]
[]
[]
[]
[]
[]
[]
[]
[]
[]
[]
[]
[]
[]
[]
[]
[]
[]
[]
[]
[]
[]
[]
[]
[]
[]
[]
[]
[]
[]
[]
[]
[]
[]
[]
[]
[]
[]
[]
[]
[]
[]
[]
[]
[]
[]
[]
[]
[]
[]
[]
[]
[]
[]
[]
[]
[]
[]
[]
[]
[]
[]
[]
[]
[]
[]
[]
[]
[]
[]
[]
[]
[]
[]
[]
[]
[]
[]
[]
[]
[]
[]
[]
[]
[]
[]
[]
[]
[]
[]
[]
[]
[]
[]
[]
[]
[]
[]
[]
[]
[]
[]
[]
[]
[]
[]
[]
[]
[]
[]
[]
[]
[]
[]
[]
[]
[]
[]
[]
[]
[]
[]
[]
[]
[]
[]
[]
[]
[]
[]
[]
[]
[]
[]
[]
[]
[]
[]
[]
[]
[]
[]
[]
[]
[]
[]
[]
[]
[]
[]
[]
[]
[]
[]
[]
[]
[]
[]
[]
[]
[]
[]
[]
[]
[]
[]
[]
[]
[]
[]
[]
[]
[]
[]
[]
[]
[]
[]
[]
[]
[]
[]
[]
[]
[]
[]
[]
[]
[]
[]
[]
[]
[]
[]
[]
[]
[]
[]
[]
[]
[]
[]
[]
[]
[]
[]
[]
[]
[]
[]
[]
[]
[]
[]
[]
[]
[]
[]
[]
[]
[]
[]
[]
[]
[]
[]
[]
[]
[]
[]
[]
[]
[]
[]
[]
[]
[]
[]
[]
[]
[]
[]
[]
[]
[]
[]
[]
[]
[]
[]
[]
[]
[]
[]
[]
[]
[]
[]
[]
[]
[]
[]
[]
[]
[]
[]
[]
[]
[]
[]
[]
[]
[]
[]
[]
[]
[]
[]
[]
[]
[]
[]
[]
[]
[]
[]
[]
[]
[]
[]
[]
[]
[]
[]
[]
[]
[]
[]
[]
[]
[]
[]
[]
[]
[]
[]
[]
[]
[]
[]
[]
[]
[]
[]
[]
[]
[]
[]
[]
[]
[]
[]
[]
[]
[]
[]
[]
[]
[]
[]
[]
[]
[]
[]
[]
[]
[]
[]
[]
[]
[]
[]
[]
[]
[]
[]
[]
[]
[]
[]
[]
[]
[]
[]
[]
[]
[]
[]
[]
[]
[]
[]
[]
[]
[]
[]
[]
[]
[]
[]
[]
[]
[]
[]
[]
[]
[]
[]
[]
[]
[]
[]
[]
[]
[]
[]
[]
[]
[]
[]
[]
[]
[]
[]
[]
[]
[]
[]
[]
[]
[]
[]
[]
[]
[]
[]
[]
[]
[]
[]
[]
[]
[]
[]
[]
[]
[]
[]
[]
[]
[]
[]
[]
[]
[]
[]
[]
[]
[]
[]
[]
[]
[]
[]
[]
[]
[]
[]
[]
[]
[]
[]
[]
[]
[]
[]
[]
[]
[]
[]
[]
[]
[]
[]
[]
[]
[]
[]
[]
[]
[]
[]
[]
[]
[]
[]
[]
[]
[]
[]
[]
[]
[]
[]
[]
[]
[]
[]
[]
[]
[]
[]
[]
[]
[]
[]
[]
[]
[]
[]
[]
[]
[]
[]
[]
[]
[]
[]
[]
[]
[]
[]
[]
[]
[]
[]
[]
[]
[]
[]
[]
[]
[]
[]
[]
[]
[]
[]
[]
[]
[]
[]
[]
[]
[]
[]
[]
[]
[]
[]
[]
[]
[]
[]
[]
[]
[]
[]
[]
[]
[]
[]
[]
[]
[]
[]
[]
[]
[]
[]
[]
[]
[]
[]
[]
[]
[]
[]
[]
[]
[]
[]
[]
[]
[]
[]
[]
[]
[]
[]
[]
[]
[]
[]
[]
[]
[]
[]
[]
[]
[]
[]
[]
[]
[]
[]
[]
[]
[]
[]
[]
[]
[]
[]
[]
[]
[]
[]
[]
[]
[]
[]
[]
[]
[]
[]
[]
[]
[]
[]
[]
[]
[]
[]
[]
[]
[]
[]
[]
[]
[]
[]
[]
[]
[]
[]
[]
[]
[]
[]
[]
[]
[]
[]
[]
[]
[]
[]
[]
[]
[]
[]
[]
[]
[]
[]
[]
[]
[]
[]
[]
[]
[]
[]
[]
[]
[]
[]
[]
[]
[]
[]
[]
[]
[]
[]
[]
[]
[]
[]
[]
[]
[]
[]
[]
[]
[]
[]
[]
[]
[]
[]
[]
[]
[]
[]
[]
[]
[]
[]
[]
[]
[]
[]
[]
[]
[]
[]
[]
[]
[]
[]
[]
[]
[]
[]
[]
[]
[]
[]
[]
[]
[]
[]
[]
[]
[]
[]
[]
[]
[]
[]
[]
[]
[]
[]
[]
[]
[]
[]
[]
[]
[]
[]
[]
[]
[]
[]
[]
[]
[]
[]
[]
[]
[]
[]
[]
[]
[]
[]
[]
[]
[]
[]
[]
[]
[]
[]
[]
[]
[]
[]
[]
[]
[]
[]
[]
[]
[]
[]
[]
[]
[]
[]
[]
[]
[]
[]
[]
[]
[]
[]
[]
[]
[]
[]
[]
[]
[]
[]
[]
[]
[]
[]
[]
[]
[]
[]
[]
[]
[]
[]
[]
[]
[]
[]
[]
[]
[]
[]
[]
[]
[]
[]
[]
[]
[]
[]
[]
[]
[]
[]
[]
[]
[]
[]
[]
[]
[]
[]
[]
[]
[]
[]
[]
[]
[]
[]
[]
[]
[]
[]
[]
[]
[]
[]
[]
[]
[]
[]
[]
[]
[]
[]
[]
[]
[]
[]
[]
[]
[]
[]
[]
[]
[]
[]
[]
[]
[]
[]
[]
[]
[]
[]
[]
[]
[]
[]
[]
[]
[]
[]
[]
[]
[]
[]
[]
[]
[]
[]
[]
[]
[]
[]
[]
[]
[]
[]
[]
[]
[]
[]
[]
[]
[]
[]
[]
[]
[]
[]
[]
[]
[]
[]
[]
[]
[]
[]
[]
[]
[]
[]
[]
[]
[]
[]
[]
[]
[]
[]
[]
[]
[]
[]
[]
[]
[]
[]
[]
[]
[]
[]
[]
[]
[]
[]
[]
[]
[]
[]
[]
[]
[]
[]
[]
[]
[]
[]
[]
[]
[]
[]
[]
[]
[]
[]
[]
[]
[]
[]
[]
[]
[]
[]
[]
[]
[]
[]
[]
[]
[]
[]
[]
[]
[]
[]
[]
[]
[]
[]
[]
[]
[]
[]
[]
[]
[]
[]
[]
[]
[]
[]
[]
[]
[]
[]
[]
[]
[]
[]
[]
[]
[]
[]
[]
[]
[]
[]
[]
[]
[]
[]
[]
[]
[]
[]
[]
[]
[]
[]
[]
[]
[]
[]
[]
[]
[]
[]
[]
[]
[]
[]
[]
[]
[]
[]
[]
[]
[]
[]
[]
[]
[]
[]
[]
[]
[]
[]
[]
[]
[]
[]
[]
[]
[]
[]
[]
[]
[]
[]
[]
[]
[]
[]
[]
[]
[]
[]
[]
[]
[]
[]
[]
[]
[]
[]
[]
[]
[]
[]
[]
[]
[]
[]
[]
[]
[]
[]
[]
[]
[]
[]
[]
[]
[]
[]
[]
[]
[]
[]
[]
[]
[]
[]
[]
[]
[]
[]
[]
[]
[]
[]
[]
[]
[]
[]
[]
[]
[]
[]
[]
[]
[]
[]
[]
[]
[]
[]
[]
[]
[]
[]
[]
[]
[]
[]
[]
[]
[]
[]
[]
[]
[]
[]
[]
[]
[]
[]
[]
[]
[]
[]
[]
[]
[]
[]
[]
[]
[]
[]
[]
[]
[]
[]
[]
[]
[]
[]
[]
[]
[]
[]
[]
[]
[]
[]
[]
[]
[]
[]
[]
[]
[]
[]
[]
[]
[]
[]
[]
[]
[]
[]
[]
[]
[]
[]
[]
[]
[]
[]
[]
[]
[]
[]
[]
[]
[]
[]
[]
[]
[]
[]
[]
[]
[]
[]
[]
[]
[]
[]
[]
[]
[]
[]
[]
[]
[]
[]
[]
[]
[]
[]
[]
[]
[]
[]
[]
[]
[]
[]
[]
[]
[]
[]
[]
[]
[]
[]
[]
[]
[]
[]
[]
[]
[]
[]
[]
[]
[]
[]
[]
[]
[]
[]
[]
[]
[]
[]
[]
[]
[]
[]
[]
[]
[]
[]
[]
[]
[]
[]
[]
[]
[]
[]
[]
[]
[]
[]
[]
[]
[]
[]
[]
[]
[]
[]
[]
[]
[]
[]
[]
[]
[]
[]
[]
[]
[]
[]
[]
[]
[]
[]
[]
[]
[]
[]
[]
[]
[]
[]
[]
[]
[]
[]
[]
[]
[]
[]
[]
[]
[]
[]
[]
[]
[]
[]
[]
[]
[]
[]
[]
[]
[]
[]
[]
[]
[]
[]
[]
[]
[]
[]
[]
[]
[]
[]
[]
[]
[]
[]
[]
[]
[]
[]
[]
[]
[]
[]
[]
[]
[]
[]
[]
[]
[]
[]
[]
[]
[]
[]
[]
[]
[]
[]
[]
[]
[]
[]
[]
[]
[]
[]
[]
[]
[]
[]
[]
[]
[]
[]
[]
[]
[]
[]
[]
[]
[]
[]
[]
[]
[]
[]
[]
[]
[]
[]
[]
[]
[]
[]
[]
[]
[]
[]
[]
[]
[]
[]
[]
[]
[]
[]
[]
[]
[]
[]
[]
[]
[]
[]
[]
[]
[]
[]
[]
[]
[]
[]
[]
[]
[]
[]
[]
[]
[]
[]
[]
[]
[]
[]
[]
[]
[]
[]
[]
[]
[]
[]
[]
[]
[]
[]
[]
[]
[]
[]
[]
[]
[]
[]
[]
[]
[]
[]
[]
[]
[]
[]
[]
[]
[]
[]
[]
[]
[]
[]
[]
[]
[]
[]
[]
[]
[]
[]
[]
[]
[]
[]
[]
[]
[]
[]
[]
[]
[]
[]
[]
[]
[]
[]
[]
[]
[]
[]
[]
[]
[]
[]
[]
[]
[]
[]
[]
[]
[]
[]
[]
[]
[]
[]
[]
[]
[]
[]
[]
[]
[]
[]
[]
[]
[]
[]
[]
[]
[]
[]
[]
[]
[]
[]
[]
[]
[]
[]
[]
[]
[]
[]
[]
[]
[]
[]
[]
[]
[]
[]
[]
[]
[]
[]
[]
[]
[]
[]
[]
[]
[]
[]
[]
[]
[]
[]
[]
[]
[]
[]
[]
[]
[]
[]
[]
[]
[]
[]
[]
[]
[]
[]
[]
[]
[]
[]
[]
[]
[]
[]
[]
[]
[]
[]
[]
[]
[]
[]
[]
[]
[]
[]
[]
[]
[]
[]
[]
[]
[]
[]
[]
[]
[]
[]
[]
[]
[]
[]
[]
[]
[]
[]
[]
[]
[]
[]
[]
[]
[]
[]
[]
[]
[]
[]
[]
[]
[]
[]
[]
[]
[]
[]
[]
[]
[]
[]
[]
[]
[]
[]
[]
[]
[]
[]
[]
[]
[]
[]
[]
[]
[]
[]
[]
[]
[]
[]
[]
[]
[]
[]
[]
[]
[]
[]
[]
[]
[]
[]
[]
[]
[]
[]
[]
[]
[]
[]
[]
[]
[]
[]
[]
[]
[]
[]
[]
[]
[]
[]
[]
[]
[]
[]
[]
[]
[]
[]
[]
[]
[]
[]
[]
[]
[]
[]
[]
[]
[]
[]
[]
[]
[]
[]
[]
[]
[]
[]
[]
[]
[]
[]
[]
[]
[]
[]
[]
[]
[]
[]
[]
[]
[]
[]
[]
[]
[]
[]
[]
[]
[]
[]
[]
[]
[]
[]
[]
[]
[]
[]
[]
[]
[]
[]
[]
[]
[]
[]
[]
[]
[]
[]
[]
[]
[]
[]
[]
[]
[]
[]
[]
[]
[]
[]
[]
[]
[]
[]
[]
[]
[]
[]
[]
[]
[]
[]
[]
[]
[]
[]
[]
[]
[]
[]
[]
[]
[]
[]
[]
[]
[]
[]
[]
[]
[]
[]
[]
[]
[]
[]
[]
[]
[]
[]
[]
[]
[]
[]
[]
[]
[]
[]
[]
[]
[]
[]
[]
[]
[]
[]
[]
[]
[]
[]
[]
[]
[]
[]
[]
[]
[]
[]
[]
[]
[]
[]
[]
[]
[]
[]
[]
[]
[]
[]
[]
[]
[]
[]
[]
[]
[]
[]
[]
[]
[]
[]
[]
[]
[]
[]
[]
[]
[]
[]
[]
[]
[]
[]
[]
[]
[]
[]
[]
[]
[]
[]
[]
[]
[]
[]
[]
[]
[]
[]
[]
[]
[]
[]
[]
[]
[]
[]
[]
[]
[]
[]
[]
[]
[]
[]
[]
[]
[]
[]
[]
[]
[]
[]
[]
[]
[]
[]
[]
[]
[]
[]
[]
[]
[]
[]
[]
[]
[]
[]
[]
[]
[]
[]
[]
[]
[]
[]
[]
[]
[]
[]
[]
[]
[]
[]
[]
[]
[]
[]
[]
[]
[]
[]
[]
[]
[]
[]
[]
[]
[]
[]
[]
[]
[]
[]
[]
[]
[]
[]
[]
[]
[]
[]
[]
[]
[]
[]
[]
[]
[]
[]
[]
[]
[]
[]
[]
[]
[]
[]
[]
[]
[]
[]
[]
[]
[]
[]
[]
[]
[]
[]
[]
[]
[]
[]
[]
[]
[]
[]
[]
[]
[]
[]
[]
[]
[]
[]
[]
[]
[]
[]
[]
[]
[]
[]
[]
[]
[]
[]
[]
[]
[]
[]
[]
[]
[]
[]
[]
[]
[]
[]
[]
[]
[]
[]
[]
[]
[]
[]
[]
[]
[]
[]
[]
[]
[]
[]
[]
[]
[]
[]
[]
[]
[]
[]
[]
[]
[]
[]
[]
[]
[]
[]
[]
[]
[]
[]
[]
[]
[]
[]
[]
[]
[]
[]
[]
[]
[]
[]
[]
[]
[]
[]
[]
[]
[]
[]
[]
[]
[]
[]
[]
[]
[]
[]
[]
[]
[]
[]
[]
[]
[]
[]
[]
[]
[]
[]
[]
[]
[]
[]
[]
[]
[]
[]
[]
[]
[]
[]
[]
[]
[]
[]
[]
[]
[]
[]
[]
[]
[]
[]
[]
[]
[]
[]
[]
[]
[]
[]
[]
[]
[]
[]
[]
[]
[]
[]
[]
[]
[]
[]
[]
[]
[]
[]
[]
[]
[]
[]
[]
[]
[]
[]
[]
[]
[]
[]
[]
[]
[]
[]
[]
[]
[]
[]
[]
[]
[]
[]
[]
[]
[]
[]
[]
[]
[]
[]
[]
[]
[]
[]
[]
[]
[]
[]
[]
[]
[]
[]
[]
[]
[]
[]
[]
[]
[]
[]
[]
[]
[]
[]
[]
[]
[]
[]
[]
[]
[]
[]
[]
[]
[]
[]
[]
[]
[]
[]
[]
[]
[]
[]
[]
[]
[]
[]
[]
[]
[]
[]
[]
[]
[]
[]
[]
[]
[]
[]
[]
[]
[]
[]
[]
[]
[]
[]
[]
[]
[]
[]
[]
[]
[]
[]
[]
[]
[]
[]
[]
[]
[]
[]
[]
[]
[]
[]
[]
[]
[]
[]
[]
[]
[]
[]
[]
[]
[]
[]
[]
[]
[]
[]
[]
[]
[]
[]
[]
[]
[]
[]
[]
[]
[]
[]
[]
[]
[]
[]
[]
[]
[]
[]
[]
[]
[]
[]
[]
[]
[]
[]
[]
[]
[]
[]
[]
[]
[]
[]
[]
[]
[]
[]
[]
[]
[]
[]
[]
[]
[]
[]
[]
[]
[]
[]
[]
[]
[]
[]
[]
[]
[]
[]
[]
[]
[]
[]
[]
[]
[]
[]
[]
[]
[]
[]
[]
[]
[]
[]
[]
[]
[]
[]
[]
[]
[]
[]
[]
[]
[]
[]
[]
[]
[]
[]
[]
[]
[]
[]
[]
[]
[]
[]
[]
[]
[]
[]
[]
[]
[]
[]
[]
[]
[]
[]
[]
[]
[]
[]
[]
[]
[]
[]
[]
[]
[]
[]
[]
[]
[]
[]
[]
[]
[]
[]
[]
[]
[]
[]
[]
[]
[]
[]
[]
[]
[]
[]
[]
[]
[]
[]
[]
[]
[]
[]
[]
[]
[]
[]
[]
[]
[]
[]
[]
[]
[]
[]
[]
[]
[]
[]
[]
[]
[]
[]
[]
[]
[]
[]
[]
[]
[]
[]
[]
[]
[]
[]
[]
[]
[]
[]
[]
[]
[]
[]
[]
[]
[]
[]
[]
[]
[]
[]
[]
[]
[]
[]
[]
[]
[]
[]
[]
[]
[]
[]
[]
[]
[]
[]
[]
[]
[]
[]
[]
[]
[]
[]
[]
[]
[]
[]
[]
[]
[]
[]
[]
[]
[]
[]
[]
[]
[]
[]
[]
[]
[]
[]
[]
[]
[]
[]
[]
[]
[]
[]
[]
[]
[]
[]
[]
[]
[]
[]
[]
[]
[]
[]
[]
[]
[]
[]
[]
[]
[]
[]
[]
[]
[]
[]
[]
[]
[]
[]
[]
[]
[]
[]
[]
[]
[]
[]
[]
[]
[]
[]
[]
[]
[]
[]
[]
[]
[]
[]
[]
[]
[]
[]
[]
[]
[]
[]
[]
[]
[]
[]
[]
[]
[]
[]
[]
[]
[]
[]
[]
[]
[]
[]
[]
[]
[]
[]
[]
[]
[]
[]
[]
[]
[]
[]
[]
[]
[]
[]
[]
[]
[]
[]
[]
[]
[]
[]
[]
[]
[]
[]
[]
[]
[]
[]
[]
[]
[]
[]
[]
[]
[]
[]
[]
[]
[]
[]
[]
[]
[]
[]
[]
[]
[]
[]
[]
[]
[]
[]
[]
[]
[]
[]
[]
[]
[]
[]
[]
[]
[]
[]
[]
[]
[]
[]
[]
[]
[]
[]
[]
[]
[]
[]
[]
[]
[]
[]
[]
[]
[]
[]
[]
[]
[]
[]
[]
[]
[]
[]
[]
[]
[]
[]
[]
[]
[]
[]
[]
[]
[]
[]
[]
[]
[]
[]
[]
[]
[]
[]
[]
[]
[]
[]
[]
[]
[]
[]
[]
[]
[]
[]
[]
[]
[]
[]
[]
[]
[]
[]
[]
[]
[]
[]
[]
[]
[]
[]
[]
[]
[]
[]
[]
[]
[]
[]
[]
[]
[]
[]
[]
[]
[]
[]
[]
[]
[]
[]
[]
[]
[]
[]
[]
[]
[]
[]
[]
[]
[]
[]
[]
[]
[]
[]
[]
[]
[]
[]
[]
[]
[]
[]
[]
[]
[]
[]
[]
[]
[]
[]
[]
[]
[]
[]
[]
[]
[]
[]
[]
[]
[]
[]
[]
[]
[]
[]
[]
[]
[]
[]
[]
[]
[]
[]
[]
[]
[]
[]
[]
[]
[]
[]
[]
[]
[]
[]
[]
[]
[]
[]
[]
[]
[]
[]
[]
[]
[]
[]
[]
[]
[]
[]
[]
[]
[]
[]
[]
[]
[]
[]
[]
[]
[]
[]
[]
[]
[]
[]
[]
[]
[]
[]
[]
[]
[]
[]
[]
[]
[]
[]
[]
[]
[]
[]
[]
[]
[]
[]
[]
[]
[]
[]
[]
[]
[]
[]
[]
[]
[]
[]
[]
[]
[]
[]
[]
[]
[]
[]
[]
[]
[]
[]
[]
[]
[]
[]
[]
[]
[]
[]
[]
[]
[]
[]
[]
[]
[]
[]
[]
[]
[]
[]
[]
[]
[]
[]
[]
[]
[]
[]
[]
[]
[]
[]
[]
[]
[]
[]
[]
[]
[]
[]
[]
[]
[]
[]
[]
[]
[]
[]
[]
[]
[]
[]
[]
[]
[]
[]
[]
[]
[]
[]
[]
[]
[]
[]
[]
[]
[]
[]
[]
[]
[]
[]
[]
[]
[]
[]
[]
[]
[]
[]
[]
[]
[]
[]
[]
[]
[]
[]
[]
[]
[]
[]
[]
[]
[]
[]
[]
[]
[]
[]
[]
[]
[]
[]
[]
[]
[]
[]
[]
[]
[]
[]
[]
[]
[]
[]
[]
[]
[]
[]
[]
[]
[]
[]
[]
[]
[]
[]
[]
[]
[]
[]
[]
[]
[]
[]
[]
[]
[]
[]
[]
[]
[]
[]
[]
[]
[]
[]
[]
[]
[]
[]
[]
[]
[]
[]
[]
[]
[]
[]
[]
[]
[]
[]
[]
[]
[]
[]
[]
[]
[]
[]
[]
[]
[]
[]
[]
[]
[]
[]
[]
[]
[]
[]
[]
[]
[]
[]
[]
[]
[]
[]
[]
[]
[]
[]
[]
[]
[]
[]
[]
[]
[]
[]
[]
[]
[]
[]
[]
[]
[]
[]
[]
[]
[]
[]
[]
[]
[]
[]
[]
[]
[]
[]
[]
[]
[]
[]
[]
[]
[]
[]
[]
[]
[]
[]
[]
[]
[]
[]
[]
[]
[]
[]
[]
[]
[]
[]
[]
[]
[]
[]
[]
[]
[]
[]
[]
[]
[]
[]
[]
[]
[]
[]
[]
[]
[]
[]
[]
[]
[]
[]
[]
[]
[]
[]
[]
[]
[]
[]
[]
[]
[]
[]
[]
[]
[]
[]
[]
[]
[]
[]
[]
[]
[]
[]
[]
[]
[]
[]
[]
[]
[]
[]
[]
[]
[]
[]
[]
[]
[]
[]
[]
[]
[]
[]
[]
[]
[]
[]
[]
[]
[]
[]
[]
[]
[]
[]
[]
[]
[]
[]
[]
[]
[]
[]
[]
[]
[]
[]
[]
[]
[]
[]
[]
[]
[]
[]
[]
[]
[]
[]
[]
[]
[]
[]
[]
[]
[]
[]
[]
[]
[]
[]
[]
[]
[]
[]
[]
[]
[]
[]
[]
[]
[]
[]
[]
[]
[]
[]
[]
[]
[]
[]
[]
[]
[]
[]
[]
[]
[]
[]
[]
[]
[]
[]
[]
[]
[]
[]
[]
[]
[]
[]
[]
[]
[]
[]
[]
[]
[]
[]
[]
[]
[]
[]
[]
[]
[]
[]
[]
[]
[]
[]
[]
[]
[]
[]
[]
[]
[]
[]
[]
[]
[]
[]
[]
[]
[]
[]
[]
[]
[]
[]
[]
[]
[]
[]
[]
[]
[]
[]
[]
[]
[]
[]
[]
[]
[]
[]
[]
[]
[]
[]
[]
[]
[]
[]
[]
[]
[]
[]
[]
[]
[]
[]
[]
[]
[]
[]
[]
[]
[]
[]
[]
[]
[]
[]
[]
[]
[]
[]
[]
[]
[]
[]
[]
[]
[]
[]
[]
[]
[]
[]
[]
[]
[]
[]
[]
[]
[]
[]
[]
[]
[]
[]
[]
[]
[]
[]
[]
[]
[]
[]
[]
[]
[]
[]
[]
[]
[]
[]
[]
[]
[]
[]
[]
[]
[]
[]
[]
[]
[]
[]
[]
[]
[]
[]
[]
[]
[]
[]
[]
[]
[]
[]
[]
[]
[]
[]
[]
[]
[]
[]
[]
[]
[]
[]
[]
[]
[]
[]
[]
[]
[]
[]
[]
[]
[]
[]
[]
[]
[]
[]
[]
[]
[]
[]
[]
[]
[]
[]
[]
[]
[]
[]
[]
[]
[]
[]
[]
[]
[]
[]
[]
[]
[]
[]
[]
[]
[]
[]
[]
[]
[]
[]
[]
[]
[]
[]
[]
[]
[]
[]
[]
[]
[]
[]
[]
[]
[]
[]
[]
[]
[]
[]
[]
[]
[]
[]
[]
[]
[]
[]
[]
[]
[]
[]
[]
[]
[]
[]
[]
[]
[]
[]
[]
[]
[]
[]
[]
[]
[]
[]
[]
[]
[]
[]
[]
[]
[]
[]
[]
[]
[]
[]
[]
[]
[]
[]
[]
[]
[]
[]
[]
[]
[]
[]
[]
[]
[]
[]
[]
[]
[]
[]
[]
[]
[]
[]
[]
[]
[]
[]
[]
[]
[]
[]
[]
[]
[]
[]
[]
[]
[]
[]
[]
[]
[]
[]
[]
[]
[]
[]
[]
[]
[]
[]
[]
[]
[]
[]
[]
[]
[]
[]
[]
[]
[]
[]
[]
[]
[]
[]
[]
[]
[]
[]
[]
[]
[]
[]
[]
[]
[]
[]
[]
[]
[]
[]
[]
[]
[]
[]
[]
[]
[]
[]
[]
[]
[]
[]
[]
[]
[]
[]
[]
[]
[]
[]
[]
[]
[]
[]
[]
[]
[]
[]
[]
[]
[]
[]
[]
[]
[]
[]
[]
[]
[]
[]
[]
[]
[]
[]
[]
[]
[]
[]
[]
[]
[]
[]
[]
[]
[]
[]
[]
[]
[]
[]
[]
[]
[]
[]
[]
[]
[]
[]
[]
[]
[]
[]
[]
[]
[]
[]
[]
[]
[]
[]
[]
[]
[]
[]
[]
[]
[]
[]
[]
[]
[]
[]
[]
[]
[]
[]
[]
[]
[]
[]
[]
[]
[]
[]
[]
[]
[]
[]
[]
[]
[]
[]
[]
[]
[]
[]
[]
[]
[]
[]
[]
[]
[]
[]
[]
[]
[]
[]
[]
[]
[]
[]
[]
[]
[]
[]
[]
[]
[]
[]
[]
[]
[]
[]
[]
[]
[]
[]
[]
[]
[]
[]
[]
[]
[]
[]
[]
[]
[]
[]
[]
[]
[]
[]
[]
[]
[]
[]
[]
[]
[]
[]
[]
[]
[]
[]
[]
[]
[]
[]
[]
[]
[]
[]
[]
[]
[]
[]
[]
[]
[]
[]
[]
[]
[]
[]
[]
[]
[]
[]
[]
[]
[]
[]
[]
[]
[]
[]
[]
[]
[]
[]
[]
[]
[]
[]
[]
[]
[]
[]
[]
[]
[]
[]
[]
[]
[]
[]
[]
[]
[]
[]
[]
[]
[]
[]
[]
[]
[]
[]
[]
[]
[]
[]
[]
[]
[]
[]
[]
[]
[]
[]
[]
[]
[]
[]
[]
[]
[]
[]
[]
[]
[]
[]
[]
[]
[]
[]
[]
[]
[]
[]
[]
[]
[]
[]
[]
[]
[]
[]
[]
[]
[]
[]
[]
[]
[]
[]
[]
[]
[]
[]
[]
[]
[]
[]
[]
[]
[]
[]
[]
[]
[]
[]
[]
[]
[]
[]
[]
[]
[]
[]
[]
[]
[]
[]
[]
[]
[]
[]
[]
[]
[]
[]
[]
[]
[]
[]
[]
[]
[]
[]
[]
[]
[]
[]
[]
[]
[]
[]
[]
[]
[]
[]
[]
[]
[]
[]
[]
[]
[]
[]
[]
[]
[]
[]
[]
[]
[]
[]
[]
[]
[]
[]
[]
[]
[]
[]
[]
[]
[]
[]
[]
[]
[]
[]
[]
[]
[]
[]
[]
[]
[]
[]
[]
[]
[]
[]
[]
[]
[]
[]
[]
[]
[]
[]
[]
[]
[]
[]
[]
[]
[]
[]
[]
[]
[]
[]
[]
[]
[]
[]
[]
[]
[]
[]
[]
[]
[]
[]
[]
[]
[]
[]
[]
[]
[]
[]
[]
[]
[]
[]
[]
[]
[]
[]
[]
[]
[]
[]
[]
[]
[]
[]
[]
[]
[]
[]
[]
[]
[]
[]
[]
[]
[]
[]
[]
[]
[]
[]
[]
[]
[]
[]
[]
[]
[]
[]
[null,{"$f":"#REF!","v":{"$error":"#REF!"}}]
[]
[]
[null,{"$f":"#REF!","v":{"$error":"#REF!"}}]
[]
[null,{"$f":"#REF!+#REF!","v":{"$error":"#REF!"}}]
[]
[null,{"$f":"#REF!","v":{"$error":"#REF!"}}]
[]
[null,{"$f":"#REF!","v":{"$error":"#REF!"}}]

{"sheet":"Lager_Schwein","index":2,"n_rows":88,"n_cols":9,"rows_kept":88,"cut":false,"hidden":false,"merged":[[26,0,36,6],[1,5,1,6]]}
["Flüssig- und Festmistanfall für Schweine",null,null,null,null,{"$f":"Deckblatt!H3","v":"Version \"2017-3.1\""},{"$f":"Deckblatt!O31","v":"2024-05-05"}]
["Betrieb:",{"$f":"Deckblatt!E15","v":"Testbetrieb"},null,null,"Untern.-Nr.:",{"$f":"Deckblatt!E25","v":141234567890}]
["mitwirkendes Unternehmen:",{"$f":"Deckblatt!E6","v":"LfULG"},null,null,"Bearbeiter:",{"$f":"Deckblatt!E8","v":"Administrator"}]
[null,null,null,null,null,"Variante:",1]
[null,"Tierplätze","Anzahl","Anzahl","Anzahl","Anfall  in m³","Anfall in m³"]
["Produktionsabschnitt",null,"Tierpl.","Tierpl.","Tierpl.","Gülle/Jauche","Festmist"]
[null,"gesamt","Gülle","Tiefstr.","Flachstr.",1,{"$f":"Betrieb!A6","v":1}]
["Jungsaueneingliederung",null,null,null,null,{"$f":"C8*G53*(F7+5)","v":0},{"$f":"(IF(G7<2,D8*D53,D8*F53)+E8*D53*VLOOKUP(G7,C66:D71,2))*(G7+1)","v":0}]
["95-135 kg",{"$f":"IF(C8+D8+E8=B8,\"\",C8+D8+E8-B8)","v":""},null,null,"",{"$f":"E8*E53*(F7+5)","v":0}]
["Zuchtsauen",null,null,null,null,{"$f":"C10*G51*(F7+5)","v":0},{"$f":"(IF(G7<2,D10*D51,D10*F51)+E10*D51*VLOOKUP(G7,C66:D71,2))*(G7+1)","v":0}]
["ab 1. Belegung",{"$f":"IF(C10+D10+E10=B10,\"\",C10+D10+E10-B10)","v":""},null,null,"",{"$f":"E10*E51*(F7+5)","v":0}]
["Zuchtsauen, laktierend",null,null,null,null,{"$f":"C12*G52*(F7+5)","v":0},{"$f":"(IF(G7<2,D12*D52,D12*F52)+E12*D52*VLOOKUP(G7,C66:D71,2))*(G7+1)","v":0}]
["mit Ferkeln bis 8 kg ",{"$f":"IF(C12+D12+E12=B12,\"\",C12+D12+E12-B12)","v":""},null,null,"",{"$f":"E12*E52*(F7+5)","v":0}]
["Aufzuchtferkel",null,null,null,null,{"$f":"C14*G56*(F7+5)","v":0},{"$f":"(IF(G7<2,D14*D56,D14*F56)+E14*D56*VLOOKUP(G7,C66:D71,2))*(G7+1)","v":0}]
[" 8 - 28 kg ",{"$f":"IF(C14+D14+E14=B14,\"\",C14+D14+E14-B14)","v":""},null,null,"",{"$f":"E14*E56*(F7+5)","v":0}]
["Eber",null,null,null,null,{"$f":"C16*G54*(F7+5)","v":0},{"$f":"(IF(G7<2,D16*D54,D16*F54)+E16*D54*VLOOKUP(G7,C66:D71,2))*(G7+1)","v":0}]
["ab 50 kg",{"$f":"IF(C16+D16+E16=B16,\"\",C16+D16+E16-B16)","v":""},null,null,null,{"$f":"E16*E54*(F7+5)","v":0}]
["Jungsauenaufzucht",null,null,null,null,{"$f":"C18*G57*(F7+5)","v":0},{"$f":"(IF(G7<2,D18*D57,D18*F57)+E18*D57*VLOOKUP(G7,C66:D71,2))*(G7+1)","v":0}]
["28-95 kg",{"$f":"IF(C18+D18+E18=B18,\"\",C18+D18+E18-B18)","v":""},null,null,"",{"$f":"E18*E57*(F7+5)","v":0}]
["Mastschweine 28-115 kg",null,null,null,null,{"$f":"C20*G59*(F7+5)","v":0},{"$f":"(IF(G7<2,D20*D59,D20*F59)+E20*D59*VLOOKUP(G7,C66:D71,2))*(G7+1)","v":0}]
["Trocken- / Breifütterung",{"$f":"IF(C20+D20+E20=B20,\"\",C20+D20+E20-B20)","v":""},null,null,null,{"$f":"(E20*E59)*(F7+5)","v":0}]
["Mastschweine 28-115kg",null,null,null,null,{"$f":"G60*C22*(F7+5)","v":0},{"$f":"(IF(G7<2,D22*D60,D22*F60)+E22*D60*VLOOKUP(G7,C66:D71,2))*(G7+1)","v":0}]
["Flüssigfütterung",{"$f":"IF(C22+D22+E22=B22,\"\",C22+D22+E22-B22)","v":""},null,null,null,{"$f":"(E22*E60)*(F7+5)","v":0}]
["Summe Schweine",{"$f":"B8+B10+B12+B14+B16+B18+B20+B22","v":0},null,null,null,{"$f":"SUM(F8:F23)","v":0},{"$f":"SUM(G22,G18,G14,G20,G12,G10,G8,G16)","v":0}]
[]
["Kommentar:"]
[]
[]
[]
[]
[]
[]
[]
[]
[]
[]
[]
[]
[]
[]
[]
[null,null,null,null,null,null,null,null," "]
[]
[]
[]
[]
[]
[]
[null,null,"Frischmist","Frischmist",null,"Tiefstreu"]
[null,null,"t/Tier","Dung","Jauche","Dung","Gülle"]
["Zuchtsauen ab 1. Belegung",0.3,0.24,0.27,0.08,0.2,0.28000000000000003]
["Zuchtsauen laktierend",0.5,0.49,0.54,0.18,0.4,0.53]
[" Jungsaueneingliederung",0.23,0.155,0.17,8.3000000000000004E-2,0.15,0.21]
["Eber ab 50 kg",0.3,0.15,0.17,0.125,0.3,0.3]
[]
[" Ferkel 8 bis 28 kg  ",0.03,3.1E-2,3.4000000000000002E-2,2.5000000000000001E-2,0.03,0.05]
["Jungsauenaufzucht 28-95 kg ",0.12,0.115,0.13,0.05,0.13,0.15]
[]
["Mastschweine 28- 115 kg Trockenfütterung",0.14000000000000001,0.09,0.1,0.05,0.1,0.13300000000000001]
["Mastschweine 28 - 115 kg Flüssigfütterung",0.14000000000000001,0.09,0.1,0.06,0.1,0.16300000000000001]
[]
[null,"Trocken- oder Breifutter mit Tränke im Trog"]
[null,"Flüssigfütterung und/oder Tränke in der Bucht"]
["33 Tage"]
["2 Monate"]
["3 Monate","ja",1,1]
["4 Monate","nein",2,0.86599999999999999]
["5 Monate",null,3,0.8]
["6 Monate",null,4,0.76]
["7 Monate",null,5,0.73]
["8 Monate",null,6,0.73]
["9 Monate"]
["10 Monate"]
["11 Monate"]
["12 Monate"]
[]
[]
[]
[]
[]
[]
[]
[]
[null,null,null,"Rundbehälter",null,"20 cm Strohhäcksel"]
[null,null,null,"Rechteckbeh.",null,"10 cm Strohhäcksel",null,"ja"]
[null,null,null,"Re.-Trapezbeh.",null,"Pegülith",null,"nein"]
[null,null,null,"Staukanal",null,"nat. Schwimmdecke"]
[null,null,null,"Güllekeller",null,"wasserdichter Abd."]

{"sheet":"Koferm","index":3,"n_rows":57,"n_cols":9,"rows_kept":57,"cut":false,"hidden":false,"merged":[[0,7,0,8],[1,6,1,8],[2,6,2,8],[48,0,48,8],[38,7,40,8],[50,7,50,8],[56,7,56,8],[51,7,51,8],[52,7,52,8],[53,7,53,8],[54,7,54,8],[55,7,55,8]]}
["Wirtschaftsdüngeranfall aus Kofermenten",null,null,null,null,null,{"$f":"Deckblatt!H3","v":"Version \"2017-3.1\""},{"$f":"Deckblatt!O31","v":"2024-05-05"}]
["Betrieb:",null,{"$f":"Deckblatt!E15","v":"Testbetrieb"},null,null,"Untern.-Nr.:",{"$f":"Deckblatt!E25","v":141234567890}]
["mitwirk. Unternehmen:",null,{"$f":"Deckblatt!E6","v":"LfULG"},null,null,"Bearbeiter:",{"$f":"Deckblatt!E8","v":"Administrator"}]
["Kofermente 1)",null,"TS in %","Einheit","Menge je Jahr in t","Fugat in m³/ t Koferment","Fugat / Jahr in m³"]
["Festmist frisch",null,25,"t",null,0.93,{"$f":"F5*E5","v":0}]
["Trockenkot (Geflügel)",null,60,"t",null,0.76,{"$f":"F6*E6","v":0}]
["Maissilage",null,32,"t",null,0.76,{"$f":"F7*E7","v":0}]
["Gras- / Ganzpflanzensilage",null,40,"t",null,0.75230357142857152,0]
["Lieschkolbensilage LKS",null,45,"t",null,0.6302928571428571,0]
["Getreide (Körner), Rapssaat",null,87,"t",null,0.24886964285714275,0]
["CornCrobMix",null,65,"t",null,0.45,0]
["Zuckerrüben",null,23,"t",null,0.79965535714285718,0]
["Futterrüben",null,15,"t",null,0.9,0]
["Kartoffeln",null,22,"t",null,0.8,0]
["Grünmais",null,28,"t",null,0.79759999999999998,0]
["Kleegras",null,17,"t",null,0.89556785714285714,0]
["Rotklee Pflanze",null,20,"t",null,0.88138571428571433,0]
["Wiesengras",null,20,"t",null,0.86721785714285715,0]
["Raps Ganzpflanze",null,14,"t",null,0.90264999999999995,0]
["Zuckerhirse, Sudangras",null,18,"t",null,0.89,0]
["Stroh",null,86,"t",null,0.6,0]
["Wiesenheu",null,86,"t",null,0.47912857142857146,0]
["Kartoffelschlempe frisch",null,7,"t",null,1,0]
["Altbrot",null,65,"t",null,0.37,{"$f":"F24*E24","v":0}]
["Backabfälle",null,87,"t",null,0.15253749999999988,0]
["Bierhefe",null,10,"t",null,0.92745357142857143,0]
["Biertreber",null,24,"t",null,0.85033214285714287,0]
["Kartoffelflocken, -schrot",null,88,"t",null,0.25567321428571432,0]
["Kartoffelpreßpülpe",null,18,"t",null,0.8392857142857143,0]
["Kartoffelschälabfall",null,11,"t",null,0.90977857142857144,0]
["Leinenextraktionsschrot",null,88,"t",null,0.36329821428571418,0]
["Magermilch, Molke",null,8,"t",null,1,0]
["Malzkeime",null,92,"t",null,0.42167500000000002,0]
["Melasse",null,77,"t",null,0.39148571428571433,0]
["Milchzuckermelasse",null,30,"t",null,0.79392142857142856,0]
["Molke teilentzu. Trocken",null,95,"t",null,0.32866428571428563,0]
["Obsttrester Apfel",null,22,"t",null,0.85937142857142856,0]
["Rapsextraktionsschrot",null,88,"t",null,0.42807142857142855,0]
["Rapskuchen kaltpr. 15 % Fett",null,91,"t",null,0.34570714285714277,0,"Berechnung eigener Fugatfaktoren"]
["Weizenkleie",null,88,"t",null,0.44842857142857151,{"$f":"F40*E40","v":0}]
["Weizennachmehl",null,88,"t",null,0.25308035714285715,0]
["Zuckerrübennaßschnitzel",null,13,"t",null,0.9053714285714286,0,"Gas-","Methan-"]
["Zuckerrübenpreßschnitzel",null,20,"t",null,0.83308571428571432,0,"ertrag","gehalt"]
["Zuckerrübentrockenschnitzel",null,91,"t",null,0.18800714285714282,0,"in m³/t","in %"]
["eigenes Substrat",null,null,"t",null,{"$f":"IF(1-((I45*16+(100%-I45)*44)*(1000/22.4)*H45/1000000)<0,0,1-((I45*16+(100%-I45)*44)*(1000/22.4)*H45/1000000))","v":1},0]
["eigenes Substrat",null,null,"t",null,{"$f":"IF(1-((I46*16+(100%-I46)*44)*(1000/22.4)*H46/1000000)<0,0,1-((I46*16+(100%-I46)*44)*(1000/22.4)*H46/1000000))","v":1},0]
["eigenes Substrat",null,null,"t",null,{"$f":"IF(1-((I47*16+(100%-I47)*44)*(1000/22.4)*H47/1000000)<0,0,1-((I47*16+(100%-I47)*44)*(1000/22.4)*H47/1000000))","v":1},0]
["Summe",null,null,null,null,null,{"$f":"SUM(G5:G47)","v":0}]
["1) Bei überwiegender Vergärung von Substraten mit hohem Trockensubstanzgehalt kann es erforderlich sein, Prozesswasser einzusetzen. Dieses Prozesswasser ist bei der Berechnung der Lagerkapazität zusätzlich zu berücksichtigen."]
["Gülle-/Gärrestseparation"]
["Inputmaterial in m³ je Jahr"," TS-Gehalt Inputmaterial in  %","TS-Gehalt Feststoffe in %","TS-Gehalt Flüssig-phase in %","Abscheide- grad in %","Flüssigphase in m³ je Jahr","Feststoffe in t je Jahr","Feststoffe in m³ je Jahr"]
[null,null,null,null,{"$f":"IF(A52=\"\",\"\",(B52-D52)/(C52-D52))","v":""},{"$f":"IF(A52=\"\",\"\",A52-G52)","v":""},{"$f":"IF(A52=\"\",\"\",A52*(B52-D52)/(C52-D52))","v":""},{"$f":"IF(A52=\"\",\"\",G52/0.75)","v":""}]
[null,null,null,null,{"$f":"IF(A53=\"\",\"\",(B53-D53)/(C53-D53))","v":""},{"$f":"IF(A53=\"\",\"\",A53-G53)","v":""},{"$f":"IF(A53=\"\",\"\",A53*(B53-D53)/(C53-D53))","v":""},{"$f":"IF(A53=\"\",\"\",G53/0.75)","v":""}]
[null,null,null,null,"",{"$f":"IF(A54=\"\",\"\",A54-G54)","v":""},{"$f":"IF(A54=\"\",\"\",A54*(B54-D54)/(C54-D54))","v":""},{"$f":"IF(A54=\"\",\"\",G54/0.75)","v":""}]
[null,null,null,null,"",{"$f":"IF(A55=\"\",\"\",A55-G55)","v":""},{"$f":"IF(A55=\"\",\"\",A55*(B55-D55)/(C55-D55))","v":""},{"$f":"IF(A55=\"\",\"\",G55/0.75)","v":""}]
[null,null,null,null,"",{"$f":"IF(A56=\"\",\"\",A56-G56)","v":""},{"$f":"IF(A56=\"\",\"\",A56*(B56-D56)/(C56-D56))","v":""},{"$f":"IF(A56=\"\",\"\",G56/0.75)","v":""}]
[{"$f":"SUM(A52:A56)","v":0},null,null,null,null,{"$f":"SUM(F52:F56)","v":0},{"$f":"SUM(G52:G56)","v":0},{"$f":"SUM(H52:H56)","v":0}]

{"sheet":"Betrieb","index":4,"n_rows":93,"n_cols":22,"rows_kept":93,"cut":false,"hidden":false,"merged":[[70,8,70,9],[32,1,32,10],[6,6,6,8],[1,8,1,9],[21,6,21,7],[27,6,27,7],[67,0,68,10],[34,8,34,9],[3,8,3,9]]}
["Berechnung der Festmistlagerkapazität für den Gesamtbetrieb",null,null,null,null,null,null,null,null,null,{"$f":"Deckblatt!H3","v":"Version \"2017-3.1\""}]
["Betrieb:",{"$f":"Deckblatt!E15","v":"Testbetrieb"},null,null,null,null,"Untern.-Nr.:",null,{"$f":"Deckblatt!E25","v":141234567890},null,{"$f":"Deckblatt!O31","v":"2024-05-05"}]
["mitwirk. Unternehmen:",{"$f":"Deckblatt!E6","v":"LfULG"},null,null,null,null,"Bearbeiter:",null,{"$f":"Deckblatt!E8","v":"Administrator"}]
["Jahresniederschlag in mm",null,"(langjähriges Mittel)",null,null,{"$f":"Deckblatt!O33","v":600},"Variante:",null,"Test"]
["Anfall an Festmist für","Rinder",null,null,null,null,"Schweine"]
[1,"Schafe",null,null,null,null,"Ziegen"]
[null,"Pferde",null,null,null,null,"Mehr-/ Minderanfall"]
[null,null,null,null,null,"Summe Anfall",null,null,null,{"$f":"SUM(E5:E7)+J5+J6+J7","v":0},"m³"]
["Vorhandene Läger","Anzahl","Länge","Breite","od. altern.","Stapelhöhe","Lagerung","Schiebefl.","Kapazität","Oberfl.-","Zuordnung",null,null,"tägl. Anfall","Lager Stall","Kap sonst","Anf","Tage Stall",{"$f":"I20/J8*(A6+1)*30","v":{"$error":"#DIV/0!"}}]
["(incl.Tiefstreu im Stall)","Behält.","in m","in m","Fläche i. m²","in m","Überdachung","in m²","in m³","wasser m³","Lagerstätte",null,null,{"$f":"E5/(A6*IF(A6=1,33,30))","v":0},{"$f":"SUMIFS(I$11:I$19,G$11:G$19,3,K$11:K$19,1)","v":0},{"$f":"SUMIFS(I$11:I$19,G$11:G$19,1,K$11:K$19,1)+SUMIFS(I$11:I$19,G$11:G$19,2,K$11:K$19,1)","v":0},{"$f":"IF(R10<(A6+1)*30,E5,0)","v":0},{"$f":"IF(E5=0,0,O10/(E5/((A6+1)*30)))","v":0},"Rinder"]
[null,null,null,null,null,null,2,null,{"$f":"IF(E11=0,C11*D11*F11*B11,E11*F11*B11)","v":0},{"$f":"IF(G11=2,IF(E11=0,(B11*C11*D11+H11)*$F$4/1000*($A$41+5)*30/360*0.7,(B11*E11+H11)*$F$4/1000*($A$41+5)*30/360*0.7),H11*$F$4/1000*($A$41+5)*30/360*0.7)","v":0},6,null,null,{"$f":"J5/(A6*IF(A6=1,33,30))","v":0},{"$f":"SUMIFS(I$11:I$19,G$11:G$19,3,K$11:K$19,2)","v":0},{"$f":"SUMIFS(I$11:I$19,G$11:G$19,1,K$11:K$19,2)+SUMIFS(I$11:I$19,G$11:G$19,2,K$11:K$19,2)","v":0},{"$f":"IF(R11<(A6+1)*30,J5,0)","v":0},{"$f":"IF(J5=0,0,O11/(J5/(A6*IF(A6=1,33,30))))","v":0},"Schweine"]
[null,null,null,null,null,null,2,null,0,0,5,null,null,{"$f":"E6/(A6*IF(A6=1,33,30))","v":0},{"$f":"SUMIFS(I$11:I$19,G$11:G$19,3,K$11:K$19,3)","v":0},{"$f":"SUMIFS(I$11:I$19,G$11:G$19,1,K$11:K$19,3)+SUMIFS(I$11:I$19,G$11:G$19,2,K$11:K$19,3)","v":0},{"$f":"IF(R12<(A6+1)*30,E6,0)","v":0},{"$f":"IF(E6=0,0,O12/(E6/(A6*IF(A6=1,33,30))))","v":0},"Schafe"]
[null,null,null,null,null,null,2,null,0,{"$f":"IF(G13=2,IF(E13=0,(B13*C13*D13+H13)*$F$4/1000*($A$41+5)*30/360*0.7,(B13*E13+H13)*$F$4/1000*($A$41+5)*30/360*0.7),H13*$F$4/1000*($A$41+5)*30/360*0.7)","v":0},6,null,null,{"$f":"J6/(A6*IF(A6=1,33,30))","v":0},{"$f":"SUMIFS(I$11:I$19,G$11:G$19,3,K$11:K$19,4)","v":0},{"$f":"SUMIFS(I$11:I$19,G$11:G$19,1,K$11:K$19,4)+SUMIFS(I$11:I$19,G$11:G$19,2,K$11:K$19,4)","v":0},{"$f":"IF(R13<(A6+1)*30,J6,0)","v":0},{"$f":"IF(J6=0,0,O13/(J6/(A6*IF(A6=1,33,30))))","v":0},"Ziegen"]
[null,null,null,null,null,null,2,null,0,0,6,null,null,{"$f":"E7/(A6*IF(A6=1,33,30))","v":0},{"$f":"SUMIFS(I$11:I$19,G$11:G$19,3,K$11:K$19,5)","v":0},{"$f":"SUMIFS(I$11:I$19,G$11:G$19,1,K$11:K$19,5)+SUMIFS(I$11:I$19,G$11:G$19,2,K$11:K$19,5)","v":0},{"$f":"IF(R14<(A6+1)*30,E7,0)","v":0},{"$f":"IF(E7=0,0,O14/(E7/(A6*IF(A6=1,33,30))))","v":0},"Pferde"]
[null,null,null,null,null,null,2,null,0,0,6,null,null,null,null,null,null,0,"alle Kategorien"]
[null,null,null,null,null,null,2,null,0,0,6,null,null,{"$f":"SUM(N10:N14)","v":0},{"$f":"SUMIFS(I$11:I$19,G$11:G$19,1,K$11:K$19,6)+SUMIFS(I$11:I$19,G$11:G$19,2,K$11:K$19,6)","v":0},{"$f":"SUMIFS(I$11:I$19,G$11:G$19,1,K$11:K$19,6)+SUMIFS(I$11:I$19,G$11:G$19,2,K$11:K$19,6)","v":0},{"$f":"SUM(Q10:Q14)+J7","v":0},{"$f":"IF(Q16=0,0,O17/(Q16/(A6+1)*30))","v":0},"alle Kategorien"]
[null,null,null,null,null,null,2,null,0,0,6,null,null,null,{"$f":"I20-SUMIFS(O10:O16,Q10:Q16,0)","v":0},{"$f":"SUM(P10:P16)","v":0},{"$f":"Q16/((A6+1)*30)","v":0},{"$f":"IF(Q17=0,0,O17/Q17)","v":0},"Summe"]
[null,null,null,null,null,null,2,null,0,0,6,null,null,null,null,null,"Tage Stall Min",{"$f":"MIN(IF(R10:R15>0,R10:R15))","v":0}]
[null,null,null,null,null,null,2,null,0,0,6,null,null,null,null,null,"Tage 1",{"$f":"IF(AND(R17>0,R17<S9),R17,S9)","v":{"$error":"#DIV/0!"}}]
["Summe",null,null,null,null,null,null,null,{"$f":"SUM(I11:I19)","v":0},{"$f":"SUM(J11:J19)","v":0},null,null,null,null,null,null,"Tage 2",{"$f":"IF(AND(R17=0,Q17>0),0,R19)","v":{"$error":"#DIV/0!"}}]
["Die Lagerkapazität für Festmist von Huf- u. Klauentieren ist ausreichend für:",null,null,null,null,null,{"$f":"IF(J8>0,R20,\"\")","v":""},"Tage =",{"$f":"IF(G21=\"\",\"\",(G21/30))","v":""},"Monate"]
[2,"Geflügel / Kaninchen",null,null,null,null,"Mehr-/Minderanfall",null,null,{"$f":"E22+I22","v":0}]
[null,null,null,null,null,null,2,null,{"$f":"IF(E23=0,C23*D23*F23*B23,E23*F23*B23)","v":0},{"$f":"IF(G23=2,IF(E23=0,(B23*C23*D23+H23)*$F$4/1000*($A$41+5)*30/360*0.7,(B23*E23+H23)*$F$4/1000*($A$41+5)*30/360*0.7),H23*$F$4/1000*($A$41+5)*30/360*0.7)","v":0},null,null,null,null,null,null,null,null,null,"Dungpl.","OF-wasser"]
[null,null,null,null,null,null,2,null,{"$f":"IF(E24=0,C24*D24*F24*B24,E24*F24*B24)","v":0},{"$f":"IF(G24=2,IF(E24=0,(B24*C24*D24+H24)*$F$4/1000*($A$41+5)*30/360*0.7,(B24*E24+H24)*$F$4/1000*($A$41+5)*30/360*0.7),H24*$F$4/1000*($A$41+5)*30/360*0.7)","v":0},null,null,{"$f":"SUMIF(G11:G19,1,I11:I19)","v":0},null,null,null,null,null,null,{"$f":"SUMIF(G11:G19,2,I11:I19)","v":0},{"$f":"H20+I58+J58","v":0}]
[null,null,null,null,null,null,2,null,{"$f":"IF(E25=0,C25*D25*F25*B25,E25*F25*B25)","v":0},{"$f":"IF(G25=2,IF(E25=0,(B25*C25*D25+H25)*$F$4/1000*($A$41+5)*30/360*0.7,(B25*E25+H25)*$F$4/1000*($A$41+5)*30/360*0.7),H25*$F$4/1000*($A$41+5)*30/360*0.7)","v":0}]
["Summe",null,null,null,null,null,null,null,{"$f":"SUM(I23:I25)","v":0},{"$f":"SUM(J23:J25)","v":0},null,null,null,null,null,null,null,null,null,null,"Silowasser"]
["Die Lagerkapazität für Geflügelfestmist  ist ausreichend für:",null,null,null,null,null,{"$f":"IF(J22>0,I26/(J22/((A22+3)*30)),\"\")","v":""},"Tage =",{"$f":"IF(G27=\"\",\"\",(G27/30))","v":""},"Monate",null,null,null,null,null,null,null,null,null,null,{"$f":"IF(J38>0,Lager_Ri!$N$15,0)","v":0}]
[1,"Gülle-/Gärrestfeststoffe",null,null,null,null,"Mehr-/Minderanfall",null,null,{"$f":"E28+I28","v":0},null,null,null,null,null,null,null,null,null,null,"sickersaft"]
[null,null,null,null,null,null,2,null,{"$f":"IF(E29=0,C29*D29*F29*B29,E29*F29*B29)","v":0},{"$f":"IF(G29=2,IF(E29=0,(B29*C29*D29+H29)*$F$4/1000*($A$41+5)*30/360*0.7,(B29*E29+H29)*$F$4/1000*($A$41+5)*30/360*0.7),H29*$F$4/1000*($A$41+5)*30/360*0.7)","v":0},null,null,{"$f":"IF(G30=1,I30,0)","v":0},null,null,null,null,null,null,{"$f":"IF(G30=2,I30,0)","v":0},{"$f":"IF(J38>0,Lager_Ri!$O$15,0)","v":0}]
[null,null,null,null,null,null,1,null,{"$f":"IF(E30=0,C30*D30*F30*B30,E30*F30*B30)","v":0},{"$f":"IF(G30=2,IF(E30=0,(B30*C30*D30+H30)*$F$4/1000*($A$41+5)*30/360*0.7,(B30*E30+H30)*$F$4/1000*($A$41+5)*30/360*0.7),H30*$F$4/1000*($A$41+5)*30/360*0.7)","v":0}]
["Summe",null,null,null,null,null,null,null,{"$f":"SUM(I29:I30)","v":0},{"$f":"SUM(J29:J30)","v":0}]
["Die Lagerkapazität für Gülle- und Gärrestfeststoffe ist ausreichend für:",null,null,null,null,null,{"$f":"IF(J28>0,I31/(J28/((A28+5)*30)),\"\")","v":""},"Tage =",{"$f":"IF(G32=\"\",\"\",(G32/30))","v":""},"Monate"]
["Kommentar:"]
["Berechnung der Flüssigmistlagerkapazität für den Gesamtbetrieb",null,null,null,null,null,null,null,null,null,{"$f":"Deckblatt!H3","v":"Version \"2017-3.1\""}]
["Betrieb:",{"$f":"B2","v":"Testbetrieb"},null,null,null,null,"Untern.-Nr.:",null,{"$f":"I2","v":141234567890},null,{"$f":"K2","v":"2024-05-05"}]
["mitwirk. Unternehen:",{"$f":"Deckblatt!E6","v":"LfULG"},null,null,null,null,"Bearbeiter:",null,{"$f":"Deckblatt!E8","v":"Administrator"}]
["Jahresniederschlag in mm (langjähriges Mittel)",null,null,{"$f":"F4","v":600},null,null,"Variante:",null,{"$f":"I4","v":"Test"}]
["Anfall an","Rinder",null,null,null,"Silagesickersaft  d. Siloanlagen"]
["Flüssigmist","Schweine",null,null,null,"Gülle-/Gärrest flüssige Phase"]
["für","Geflügel",null,null,null,"Mehr- oder Minderanfall"]
[1,"Schafe/Pferde",null,null,null,"Summe Anfall",null,null,null,{"$f":"SUM(D38:D41,J38,J39)+J40","v":0}]
[null,null,null,null,null,"Niederschlag auf die Dunglager",null,null,null,{"$f":"(J20+J26+J31)","v":0}]
[]
["vorhandene Lagerkapazität"]
["Name Lager","Anzahl","Behälter-","Art d.","Pumpensumpf","Oberfläche","Grundfläche","Behälterh.","Abfüll-","sonst.einm.","Lagerraum","Volumen","Volumen","Behälterh.","Trapez-",null,"Restfüllstand"]
[null,"Behält.","form","Abdeckung","Restfüllstand","o. Durchmesser","in m²","in m","fläche m²","Flächen m²","netto* in m³","gesamt","verfügbar","verfügbar","behölter","Regenwasser","Trapezbeh.","wasserdicht",1,0.1,"Summe Abdeck","Regenwasser"]
[null,null,2,2,5,null,null,null,null,null,{"$f":"B47*IF(C47=1,(F47/2)*(F47/2)*PI()*N47-P47,IF(C47=2,F47*N47-P47,IF(C47=3,O47-P47-Q47,IF(C47=4,F47*N47,IF(E47=1,F47*(H47-0.1),F47*(H47-0.25))))))","v":0},{"$f":"B47*IF(C47=1,IF(E47=1,(F47/2)*(F47/2)*PI()*(H47),(F47/2)*(F47/2)*PI()*(H47)),IF(C47=2,IF(E47=1,F47*(H47),F47*(H47)),IF(C47=3,(F47+SQRT(F47*G47)+G47)*H47/3,IF(C47=4,F47*H47,IF(E47=1,F47*(H47),F47*(H47))))))","v":0},{"$f":"B47*IF(C47=1,(F47/2)*(F47/2)*PI()*(N47),IF(C47=2,F47*N47,IF(C47=3,O47,IF(C47=4,F47*N47,F47*N47))))","v":0},{"$f":"IF(H47=0,0,IF(C47=5,H47-0.1-VLOOKUP(E47,S$51:T$55,2),H47-VLOOKUP(D47,S$46:T$49,2)-VLOOKUP(E47,S$51:T$55,2)))","v":0},{"$f":"IF(H47=\"\",0,IF(C47=3,(F47+G47+SQRT(F47*G47))*H47/3-IF(D47=1,(F47-(F47-G47)/H47*0.1+F47)/2*0.1,IF(D47=2,(F47-(F47-G47)/H47*0.2+F47)/2*0.2,IF(D47=3,(F47-(F47-G47)/H47*0.35+F47)/2*0.35,(F47-(F47-G47)/H47*0.5+F47)/2*0.5))),0))","v":0},{"$f":"IF(D47=2,IF(C47=1,(F47/2)*(F47/2)*PI()*$D$37/1000*0.7*($A$41+5)*30/360,F47*$D$37/1000*0.7*($A$41+5)*30/360),0)","v":0},{"$f":"IF(H47=\"\",0,IF(C47=3,IF(E47=1,0,IF(E47=2,((F47-G47)/H47*0.15+G47+G47)/2*0.15,IF(E47=3,((F47-G47)/H47*0.25+G47+G47)/2*0.25,IF(E47=4,((F47-G47)/H47*0.5+G47+G47)/2*0.5,(F47-G47)/H47*1+G47+G47)/2*1))),\"\"))","v":0},"wasserdurchl.",2,0.2,{"$f":"IF(B47=0,0,IF(C47=1,B47*(F47/2)*(F47/2)*PI()*IF(D47=2,0.15,IF(D47=3,0.075,B481(D47=4,0.1,0))),IF(OR(C47=2,C47=3),B47*F47*IF(D47=2,0.15,IF(D47=3,0.075,IF(D47=4,0.1,0))),0)))","v":0},{"$f":"IF(D47=2,IF(C47=1,B47*(F47/2)*(F47/2)*PI()*$D$37/1000*0.7*($A$41+5)*30/360,B47*F47*$D$37/1000*0.7*($A$41+5)*30/360),0)","v":0}]
[null,null,3,2,5,null,null,null,null,null,{"$f":"B48*IF(C48=1,(F48/2)*(F48/2)*PI()*N48-P48,IF(C48=2,F48*N48-P48,IF(C48=3,O48-P48-Q48,IF(C48=4,F48*N48,IF(E48=1,F48*(H48-0.1),F48*(H48-0.25))))))","v":0},{"$f":"B48*IF(C48=1,IF(E48=1,(F48/2)*(F48/2)*PI()*(H48),(F48/2)*(F48/2)*PI()*(H48)),IF(C48=2,IF(E48=1,F48*(H48),F48*(H48)),IF(C48=3,(F48+SQRT(F48*G48)+G48)*H48/3,IF(C48=4,F48*H48,IF(E48=1,F48*(H48),F48*(H48))))))","v":0},0,0,{"$f":"IF(H48=\"\",0,IF(C48=3,(F48+G48+SQRT(F48*G48))*H48/3-IF(D48=1,(F48-(F48-G48)/H48*0.1+F48)/2*0.1,IF(D48=2,(F48-(F48-G48)/H48*0.2+F48)/2*0.2,IF(D48=3,(F48-(F48-G48)/H48*0.35+F48)/2*0.35,(F48-(F48-G48)/H48*0.5+F48)/2*0.5))),0))","v":0},0,{"$f":"IF(H48=\"\",0,IF(C48=3,IF(E48=1,0,IF(E48=2,((F48-G48)/H48*0.15+G48+G48)/2*0.15,IF(E48=3,((F48-G48)/H48*0.25+G48+G48)/2*0.25,IF(E48=4,((F48-G48)/H48*0.5+G48+G48)/2*0.5,(F48-G48)/H48*1+G48+G48)/2*1))),\"\"))","v":0},"gasdicht 35 cm",3,0.35,{"$f":"IF(B48=0,0,IF(C48=1,B48*(F48/2)*(F48/2)*PI()*IF(D48=2,0.15,IF(D48=3,0.075,IF(D48=4,0.1,0))),IF(OR(C48=2,C48=3),B48*F48*IF(D48=2,0.15,IF(D48=3,0.075,IF(D48=4,0.1,0))),0)))","v":0},{"$f":"IF(D48=2,IF(C48=1,B48*(F48/2)*(F48/2)*PI()*$D$37/1000*0.7*($A$41+5)*30/360,B48*F48*$D$37/1000*0.7*($A$41+5)*30/360),0)","v":0}]
[null,null,1,1,1,null,null,null,null,null,0,{"$f":"B49*IF(C49=1,IF(E49=1,(F49/2)*(F49/2)*PI()*(H49),(F49/2)*(F49/2)*PI()*(H49)),IF(C49=2,IF(E49=1,F49*(H49),F49*(H49)),IF(C49=3,(F49+SQRT(F49*G49)+G49)*H49/3,IF(C49=4,F49*H49,IF(E49=1,F49*(H49),F49*(H49))))))","v":0},0,0,0,0,0,"gasdicht 50 cm",4,0.5,0,0]
[null,null,1,1,1,null,null,null,null,null,0,0,0,0,0,0,0,null,null,null,0,0]
[null,null,1,1,2,null,null,null,null,null,0,0,0,0,0,0,0,"Pumpensumpf",1,0,0,0]
[null,null,1,1,3,null,null,null,null,null,0,0,0,0,0,0,0,"15 cm Restfüllst.",2,0.15,0,0]
[null,null,1,1,5,null,null,null,null,null,0,0,0,0,0,0,0,"25 cm Restfüllst.",3,0.25,0,0]
[null,null,1,1,5,null,null,null,null,null,0,0,0,0,0,0,0,"50 cm Restfüllst.",4,0.5,0,0]
[null,null,1,1,1,null,null,null,null,null,0,0,0,0,0,0,0,"1 m Restfüllst.",5,1,0,0]
[null,null,4,1,1,null,null,null,null,null,0,0,0,0,0,0,0,null,null,null,0,0]
["Summe Behälter aus Anlage",{"$f":"B93","v":0},null,null,null,null,null,null,{"$f":"I93","v":0},{"$f":"J93","v":0},{"$f":"K93","v":0},{"$f":"L93","v":0},{"$f":"M93","v":0},null,null,{"$f":"P93","v":0},null,null,null,null,{"$f":"Q93","v":0},{"$f":"R93","v":0}]
["Summe",{"$f":"SUM(B47:B57)","v":0},null,null,null,null,null,null,{"$f":"(SUM(I47:I56)+I62)*($F$4/1000*($A$41+5)*30/360*0.7)+I57","v":0},{"$f":"(SUM(J47:J56)+J62)*($F$4/1000*($A$41+5)*30/360*0.7)+J57","v":0},{"$f":"SUM(K47:K57)","v":0},{"$f":"SUM(L47:L57)","v":0},{"$f":"SUM(M47:M57)","v":0},null,null,{"$f":"SUM(P47:P57)","v":0},null,null,null,null,{"$f":"SUM(U47:U57)","v":0},{"$f":"SUM(V47:V57)","v":0}]
[{"$f":"IF(K58>J41+J42+I58+J58,\"freie Lagerkapazität für Flüssigmist in m³\",\"neu zu errichtende Lagerkapazität für Flüssigmist in m³\")","v":"neu zu errichtende Lagerkapazität für Flüssigmist in m³"},null,null,null,null,null,{"$f":"IF(K58>(J41+J42+I58+J58),K58-J41-I58-J58-J42,J41+J42+J58+I58-K58)","v":0},null,null,null,null,null,null,null,null,null,null,"Rundbeh."]
[null,"Anzahl","Behälter-","Art d.","Pumensumpf","Oberfläche","Grundfläche","Behälterh.","Abfüll-","sonst.einm.","Kapazität","Volumen","Volumen","nutzb.",null,null,null,"Rechteckbeh."]
[null,"Behält.","form","Abdeckung","Restfüllstand","o. Durchm.","in m²","in m","fläche m²","Flächen m²","netto in m³","gesamt","nutzbar","Behälterh.",null,null,null,"Re.-Trapez.",null,"OF-wasser"]
["Vorschlag neuer Behälter",{"$f":"B63","v":0},1,4,4,{"$f":"IF(OR(B63=0,H63=0),0,IF(K58+I58+J58<J41+J42,IF(C62=1,SQRT(G59/B62/N62/PI())*2,IF(C62=2,G59/B62/N62,IF(E62=2,IF(D62=1,(SQRT(G59/B62/N62)+H62)*(SQRT(G59/B62/N62)+H62),(SQRT(G59/B62/N62)+H62+F4/1000*0.35)*(SQRT(G59/B62/N62)+H62+F4/1000*0.35)),IF(D62=1,(SQRT(G59/B62/N62)+H62+0.15)*(SQRT(G59/B62/N62)+H62+0.15),(SQRT(G59/B62/N62)+H62+F4/1000*0.35+0.15)*(SQRT(G59/B62/N62)+H62+F4/1000*0.35+0.15))))),0))","v":0},{"$f":"IF(OR(B63=0,H63=0),0,IF(C62=3,IF(E62=2,IF(D62=1,(SQRT(G59/B62/N62)-H62)*(SQRT(G59/B62/N62)-H62),(SQRT(G59/B62/N62)-H62+F4/1000*0.35)*(SQRT(G59/B62/N62)-H62+F4/1000*0.35)),IF(D62=1,(SQRT(G59/B62/N62)-H62+0.15)*(SQRT(G59/B62/N62)-H62+0.15),(SQRT(G59/B62/N62)-H62+F4/1000*0.35+0.15)*(SQRT(G59/B62/N62)-H62+F4/1000*0.35+0.15))),\"\"))","v":0},{"$f":"H63","v":0},{"$f":"I63","v":0},{"$f":"J63","v":0},{"$f":"B62*IF(C62=1,(F62/2)*(F62/2)*PI()*N62,IF(C62=2,F62*N62,IF(C62=3,O62-P62,IF(C62=4,F62*H62*N62,IF(E62=1,F62*(H62-0.1),F62*(H62-0.25))))))","v":0},{"$f":"B62*IF(C62=1,IF(E62=1,(F62/2)*(F62/2)*PI()*(H62),(F62/2)*(F62/2)*PI()*(H62)),IF(C62=2,IF(E62=1,F62*(H62),F62*(H62)),IF(C62=3,(F62+SQRT(F62*G62)+G62)*H62/3,IF(C62=4,F62*H62,IF(E62=1,F62*(H62),F62*(H62))))))","v":0},{"$f":"B62*IF(C62=1,(F62/2)*(F62/2)*PI()*N62+P62,IF(C62=2,F62*N62+P62,IF(C62=3,O62,IF(C62=4,F62*H62*0.8,F62*N62))))","v":0},{"$f":"IF(H62=0,0,IF(D62=2,H62-0.2-VLOOKUP(E62,S$51:T$55,2)-$D$37/1000*($A$41+5)*30/360*0.7,H62-VLOOKUP(D62,S$46:T$49,2)-VLOOKUP(E62,S$51:T$55,2)))","v":0},{"$f":"IF(C62=3,(F62+G62+SQRT(F62*G62))*H62/3-IF(E62=1,F62*0.2,F62*0.2+G62*0.15),0)","v":0},{"$f":"IF(OR(D62=1,D62=3,D62=4,H62=\"\"),0,IF(C62=1,(F62/2)*(F62/2)*PI()*$D$37/1000*0.7*($A$41+5)*30/360,IF(OR(C62=2,C62=3),F62*$D$37/1000*0.7*($A$41+5)*30/360,0)))","v":0},null,"Staukanal",null,{"$f":"IF(B63=0,0,($F$4/1000*($A$41+5)*30/360*0.7)*(J62+I62))","v":0},null,{"$f":"IF(B62=0,0,IF(D62=2,IF(C62=1,B62*(F62/2)*(F62/2)*PI()*$D$37/1000*0.7*($A$41+5)*30/360,IF(OR(C62=2,C62=3),B62*F62*$D$37/1000*0.7*($A$41+5)*30/360,0)),0))","v":0}]
["geplanter neuer Behälter",null,1,4,4,null,null,null,null,null,{"$f":"B63*IF(C63=1,(F63/2)*(F63/2)*PI()*N63,IF(C63=2,F63*N63,IF(C63=3,O63-P63,IF(C63=4,F63*N63,IF(E63=1,F63*(H63-0.1),F63*(H63-0.25))))))","v":0},{"$f":"B63*IF(C63=1,IF(E63=1,(F63/2)*(F63/2)*PI()*(H63),(F63/2)*(F63/2)*PI()*(H63)),IF(C63=2,IF(E63=1,F63*(H63),F63*(H63)),IF(C63=3,(F63+SQRT(F63*G63)+G63)*H63/3,IF(C63=4,F63*H63,IF(E63=1,F63*(H63),F63*(H63))))))","v":0},{"$f":"B63*IF(C63=1,(F63/2)*(F63/2)*PI()*N63+P63,IF(C63=2,F63*N63+P63,IF(C63=3,O63,IF(C63=4,F63*H63*0.8,F63*N63))))","v":0},{"$f":"IF(H63=0,0,IF(D63=2,H63-0.2-VLOOKUP(E63,S$51:T$55,2)-$D$37/1000*($A$41+5)*30/360*0.7,H63-VLOOKUP(D63,S$46:T$49,2)-VLOOKUP(E63,S$51:T$55,2)))","v":0},{"$f":"IF(C63=3,(F63+G63+SQRT(F63*G63))*H63/3-IF(E63=1,F63*0.2,F63*0.2+G63*0.15),0)","v":0},{"$f":"IF(OR(D63=1,D63=3,D63=4,H63=\"\"),0,IF(C63=1,(F63/2)*(F63/2)*PI()*$D$37/1000*0.7*($A$41+5)*30/360,IF(OR(C63=2,C63=3),F63*$D$37/1000*0.7*($A$41+5)*30/360,0)))","v":0},null,"Güllekeller",null,null,null,{"$f":"IF(B63=0,0,IF(D63=2,IF(C63=1,B63*(F63/2)*(F63/2)*PI()*$D$37/1000*0.7*($A$41+5)*30/360,IF(OR(C63=2,C63=3),B63*F63*$D$37/1000*0.7*($A$41+5)*30/360,0)),0))","v":0}]
[]
["* Bei der Nettolagerkapazität sind in Abhängigkeit der Schalterstellungen Freibord und Restfüllstand sowie 70% des anteiligen Jahresniederschlages bereits berücksichtigt."]
[]
["Die Lagerkapazität für Flüssigmist entspricht einer Lagerdauer von:",null,null,null,null,null,null,{"$f":"IF(J41+J42>0,(M63+M58)/((J41+J42+I58+J58+V58+V63)/(($A$41+5)*30)),\"\")","v":""},"Tagen=",{"$f":"IF(H67=\"\",\"\",H67/30)","v":""},"Monaten",null,null,null,null,{"$f":"IF(J41>0,(M63+M58)/((J41+I58+J58+P58+B63*P63)/(($A$41+5)*30)),\"\")","v":""},null,"überdacht","Rind"]
["Kommentar:",null,null,null,null,null,null,null,null,null,null,null,null,null,null,null,null,"offen"]
[null,null,null,null,null,null,null,null,null,null,null,null,null,null,null,null,null,"Stall","Schwein"]
["Anlage: Berechnung Flüssigmistlagerkapazität für den Gesamtbetrieb",null,null,null,null,null,null,null,null,null,{"$f":"Deckblatt!H3","v":"Version \"2017-3.1\""}]
["Betrieb:",{"$f":"B35","v":"Testbetrieb"},null,null,null,null,"Untern.-Nr.:",null,{"$f":"I35","v":141234567890},null,{"$f":"K2","v":"2024-05-05"}]
["mitwirk. Unternehemen:",{"$f":"Deckblatt!E6","v":"LfULG"},null,null,null,null,"Bearbeiter:",null,{"$f":"Deckblatt!E8","v":"Administrator"},null,null,null,null,null,null,null,null,null,"2 Monate"]
["vorhandene Lagerkapazität",null,null,null,"Jahresniederschlag 30-jähriges Mittel (mm)",{"$f":"F4","v":600},"Variante:",null,{"$f":"I37","v":"Test"},null,null,null,null,null,null,null,null,null,"3 Monate"]
["Name Lager","Anzahl","Behälter-","Art d.","Restfüllstand","Oberfläche","Grundfläche","Behälterh.","Abfüll-","einmünd.","Lagerraum","Volumen","Volumen","Behälterh.","Trapez-","Regenwasser",null,null,"4 Monate"]
[null,"Behält.","form","Abdeckung","Pumpensumpf","o. Durchm.","in m²","in m","fläche m²","Flächen m²","netto* in m³","gesamt","nutzbar","verfügbar","behölter",null,null,null,"5 Monate"]
[null,null,4,1,1,null,null,null,null,null,{"$f":"B76*IF(C76=1,(F76/2)*(F76/2)*PI()*N76-P76,IF(C76=2,F76*N76-P76,IF(C76=3,O76-P76,IF(C76=4,F76*N76,IF(E76=1,F76*(H76-0.1),F76*(H76-0.25))))))","v":0},{"$f":"B76*IF(C76=1,IF(E76=1,(F76/2)*(F76/2)*PI()*(H76),(F76/2)*(F76/2)*PI()*(H76)),IF(C76=2,IF(E76=1,F76*(H76),F76*(H76)),IF(C76=3,(F76+SQRT(F76*G76)+G76)*H76/3,IF(C76=4,F76*H76,IF(E76=1,F76*(H76),F76*(H76))))))","v":0},{"$f":"B76*IF(C76=1,(F76/2)*(F76/2)*PI()*(N76),IF(C76=2,F76*N76,IF(C76=3,O76,IF(C76=4,F76*N76,F76*N76))))","v":0},{"$f":"IF(H76=0,0,IF(C76=5,H76-0.1-VLOOKUP(E76,S$51:T$55,2),H76-VLOOKUP(D76,S$46:T$49,2)-VLOOKUP(E76,S$51:T$55,2)))","v":0},{"$f":"IF(C76=3,(F76+G76+SQRT(F76*G76))*H76/3-IF(E76=1,F76*0.2,F76*0.2+G76*0.15),0)","v":0},{"$f":"IF(OR(D76=1,D76=3,D76=4,H76=\"\"),0,IF(C76=1,(F76/2)*(F76/2)*PI()*$D$37/1000*0.7*($A$41+5)*30/360,IF(OR(C76=2,C76=3),F76*$D$37/1000*0.7*($A$41+5)*30/360,0)))","v":0},null,{"$f":"IF(B76=0,0,IF(D76=2,IF(C76=1,B76*(F76/2)*(F76/2)*PI()*$D$37/1000*0.7*($A$41+5)*30/360,IF(OR(C76=2,C76=3),B76*F76*$D$37/1000*0.7*($A$41+5)*30/360,0)),0))","v":0},"6 Monate"]
[null,null,4,1,1,null,null,null,null,null,0,{"$f":"B77*IF(C77=1,IF(E77=1,(F77/2)*(F77/2)*PI()*(H77),(F77/2)*(F77/2)*PI()*(H77)),IF(C77=2,IF(E77=1,F77*(H77),F77*(H77)),IF(C77=3,(F77+SQRT(F77*G77)+G77)*H77/3,IF(C77=4,F77*H77,IF(E77=1,F77*(H77),F77*(H77))))))","v":0},0,0,0,0,null,{"$f":"IF(B77=0,0,IF(D77=2,IF(C77=1,B77*(F77/2)*(F77/2)*PI()*$D$37/1000*0.7*($A$41+5)*30/360,IF(OR(C77=2,C77=3),B77*F77*$D$37/1000*0.7*($A$41+5)*30/360,0)),0))","v":0},"7 Monate"]
[null,null,4,1,1,null,null,null,null,null,0,0,0,0,0,0,null,0,"8 Monate"]
[null,null,4,1,1,null,null,null,null,null,0,0,0,0,0,0,null,0,"9 Monate"]
[null,null,4,1,1,null,null,null,null,null,0,0,0,0,0,0,null,0,"10 Monate"]
[null,null,4,1,1,null,null,null,null,null,0,0,0,0,0,0,null,0,"11 Monate"]
[null,null,1,2,2,null,null,null,null,null,0,0,0,0,0,0,null,0,"12 Monate"]
[null,null,1,2,1,null,null,null,null,null,0,0,0,0,0,0,null,0]
[null,null,4,1,3,null,null,null,null,null,0,0,0,0,0,0,null,0]
[null,null,4,1,3,null,null,null,null,null,0,0,0,0,0,0,null,0]
[null,null,4,1,3,null,null,null,null,null,0,0,0,0,0,0,null,0]
[null,null,1,2,1,null,null,null,null,null,0,0,0,0,0,0,null,0]
[null,null,4,1,3,null,null,null,null,null,0,0,0,0,0,0,null,0]
[null,null,1,2,1,null,null,null,null,null,0,0,0,0,0,0,null,0]
[null,null,4,1,3,null,null,null,null,null,0,0,0,0,0,0,null,0]
[null,null,4,1,3,null,null,null,null,null,0,0,0,0,0,0,null,0]
[null,null,4,1,3,null,null,null,null,null,0,0,0,0,0,0,null,0]
["Summe",{"$f":"SUM(B76:B92)","v":0},null,null,null,null,null,null,{"$f":"SUM(I76:I92)*($F$4/1000*($A$41+5)*30/360*0.7)","v":0},{"$f":"SUM(J76:J92)*($F$4/1000*($A$41+5)*30/360*0.7)","v":0},{"$f":"SUM(K76:K92)","v":0},{"$f":"SUM(L76:L92)","v":0},{"$f":"SUM(M76:M92)","v":0},null,null,{"$f":"SUM(P76:P92)","v":0},null,{"$f":"SUM(R76:R92)","v":0}]

{"sheet":"Lager_Gefl.","index":5,"n_rows":52,"n_cols":17,"rows_kept":52,"cut":false,"hidden":false,"merged":[[44,0,44,1],[45,0,45,1],[46,0,46,1],[1,7,1,8],[14,0,14,1],[16,0,16,1],[17,0,17,1],[15,0,15,1],[52,0,53,8],[3,0,5,1],[6,0,6,1],[7,0,7,1],[9,0,9,1],[10,0,10,1],[11,0,11,1],[18,0,18,1],[19,0,19,1],[24,0,24,1],[25,0,25,1],[12,0,12,1],[13,0,13,1],[47,0,47,1],[48,0,48,1],[49,0,49,1]]}
["Flüssig- und Festmistanfall für Geflügel u. Kaninchen",null,null,null,null,null,null,{"$f":"Deckblatt!H3","v":"Version \"2017-3.1\""},{"$f":"Deckblatt!O31","v":"2024-05-05"}]
["Betrieb:",null,{"$f":"Deckblatt!E15","v":"Testbetrieb"},null,null,null,"Untern.-Nr.:",{"$f":"Deckblatt!E25","v":141234567890}]
["mitwirk. Unternehmen:",null,{"$f":"Deckblatt!E6","v":"LfULG"},null,null,null,"Bearbeiter:",{"$f":"Deckblatt!E8","v":"Administrator"}]
[null,null,"Tier-","Tierplätze","Tierplätze","Tierplätze","Anfall","Anfall","Anfall"]
[null,null,"plätze","Gülle","Trockenkot","Tiefstreu","Gülle/Jauche","Trockenkot","Festmist"]
[null,null,null,null,null,null,1,2,1]
["Legehennen",null,null,null,null,null,null,{"$f":"E7*O16/1000*(H6+4)","v":0},{"$f":"F7*P16/1000*(I6+4)","v":0}]
[null,null,{"$f":"IF(D7+E7+F7=C7,\"\",D7+E7+F7-C7)","v":""}]
["Junghennen",null,null,null,null,null,null,{"$f":"E9*O17/1000*(H6+4)","v":0},{"$f":"F9*P17/1000*(I6+4)","v":0}]
["Aufzucht",null,{"$f":"IF(D9+E9+F9=C9,\"\",D9+E9+F9-C9)","v":""}]
["Masthähnchen (Broiler)",null,null,null,null,null,null,null,{"$f":"F11*P18/1000*(I6+4)","v":0}]
["Mast über 39 Tage",null,{"$f":"IF(D11+E11+F11=C11,\"\",D11+E11+F11-C11)","v":""},null,null,null,null,null,null,null,null,null,null,"Lagerbedarf","Lagerbedarf","Lagerbedarf"]
["Masthähnchen (Broiler)",null,null,null,null,null,null,null,{"$f":"F13*P19/1000*(I6+4)","v":0},null,null,"Frischmist","Frischmist","Gülle","Trockenkot","Tiefstreu","Jauche b. Tr-kot"]
["Mast über 34 Tage",null,{"$f":"IF(D13+E13+F13=C13,\"\",D13+E13+F13-C13)","v":""}]
["Masthähnchen (Broiler)",null,null,null,null,null,null,null,{"$f":"F15*P20/1000*(I6+4)","v":0},null,null,"t/Tier","m³/Tier","1000 Tiere"]
["Mast 30 bis 33 Tage",null,{"$f":"IF(D15+E15+F15=C15,\"\",D15+E15+F15-C15)","v":""},null,null,null,null,null,null," Legehennen über 6 Monate",3.2258059999999999E-3,1.833,2.2999999999999998,null,2.2000000000000002,2.5]
["Masthähnchen (Broiler)",null,null,null,null,null,null,null,{"$f":"F17*P21/1000*(I6+4)","v":0}," Küken und Junghennen zur Aufzucht als Legehennen",1.351351E-3,0.58299999999999996,0.7,null,0.8,0.9]
["Mast bis 29 Tage",null,{"$f":"IF(D17+E17+F17=C17,\"\",D17+E17+F17-C17)","v":""},null,null,null,null,null,null," Masthähnchen (Broiler), Mast über 39 d",null,0.98399999999999999,1.2,null,null,1.2]
[" Enten zur Zucht",null,null,null,null,null,null,null,{"$f":"F19*P22/1000*(I6+4)","v":0}," Masthähnchen (Broiler), Mast über 34 d",1.4492750000000001E-3,0.92500000000000004,1.2,null,null,1.2]
[null,null,{"$f":"IF(D19+E19+F19=C19,\"\",D19+E19+F19-C19)","v":""},null,null,null,null,null,null," Masthähnchen (Broiler), Mast 30-33 d",null,0.83299999999999996,1,null,null,1]
["Mastenten","Tage Stall",null,null,null,null,{"$f":"IF(B22>0,D21*N23/1000/30*B22,D21*N23/1000*(G6+5))","v":0},null,{"$f":"IF(B22>0,F21*P23/1000/30*B22,F21*P23/1000*(I6+4))","v":0}," Masthähnchen (Broiler), Mast bis 29 d",null,0.77500000000000002,1,null,null,1]
["Pekingenten",null,{"$f":"IF(D21+E21+F21=C21,\"\",D21+E21+F21-C21)","v":""},null,null,null,null,null,null," Enten (!zur Zucht!)",6.8965509999999999E-3,8.5,10.6,null,null,10.6]
["Mastenten","Tage Stall",null,null,null,null,null,null,{"$f":"IF(B24>0,F23*P24/1000/30*B24,F23*P24/1000*(I6+4))","v":0},"Mastenten, Pekingenten",2.857142E-3,4.8,6,6,null,6]
["Flug-/Warzenenten",null,{"$f":"IF(D23+E23+F23=C23,\"\",D23+E23+F23-C23)","v":""},null,null,null,null,null,null,"Mastenten, Flugenten",null,3.83,4.8,null,null,4.8]
["Gänse zur Zucht",null,null,null,null,null,null,null,{"$f":"F25*P25/1000*(I6+4)","v":0}," Gänse (! zur Zucht !)",1.5384615000000001E-2,9.5,11.9,null,null,11.9]
[null,null,{"$f":"IF(D25+E25+F25=C25,\"\",D25+E25+F25-C25)","v":""},null,null,null,null,null,null,"Mastgänse, Kurzmast bis 5,0 kg",null,1.383,1.7,null,null,1.3]
["Mastgänse","Tage Stall",null,null,null,null,null,null,{"$f":"IF(B28>0,F27*P26/1000/30*B28,F27*P26/1000*(I6+4))","v":0},"Mastgänse Mittelmast bis 6,8 kg",6.0606059999999996E-3,3.117,3.9,null,null,3]
["Kurzmast bis 5,0 kg",null,{"$f":"IF(D27+E27+F27=C27,\"\",D27+E27+F27-C27)","v":""},null,null,null,null,null,null,"Mastgänse Langmast bis 7,8 kg",null,5.133,6.4,null,null,4.8]
["Mastgänse","Tage Stall",null,null,null,null,null,null,{"$f":"IF(B30>0,F29*P27/1000/30*B30,F29*P27/1000*(I6+4))","v":0},"Mastputen, Hennen bis 17 Wochen",1.33333333E-2,4.2,8.4,null,null,6.3]
["Mittelmast bis 6,8 kg",null,{"$f":"IF(D29+E29+F29=C29,\"\",D29+E29+F29-C29)","v":""},null,null,null,null,null,null,"Mastputen Hähne bis 21 Wochen",null,4.0330000000000004,8.1,null,null,6]
["Mastgänse","Tage Stall",null,null,null,null,null,null,{"$f":"IF(B32>0,F31*P28/1000/30*B32,F31*P28/1000*(I6+4))","v":0},"Mastputen, Hennen ab 6. Woche",null,5,10,null,null,7.5]
["Langmast bis 7,8 kg",null,{"$f":"IF(D31+E31+F31=C31,\"\",D31+E31+F31-C31)","v":""},null,null,null,null,null,null,"Mastputen Hähne ab 6. Woche",null,5.0839999999999996,10.199999999999999,null,null,7.6]
["Mastputen","Tage Stall",null,null,null,null,null,null,{"$f":"IF(B34>0,F33*P29/1000/30*B34,F33*P29/1000*(I6+4))","v":0},"Mastputen, gemischtgeschl. Mast, incl. Aufzucht",null,4.12,8.1999999999999993,null,null,6.2]
["Hennen bis 17 Wochen",null,{"$f":"IF(D33+E33+F33=C33,\"\",D33+E33+F33-C33)","v":""},null,null,null,null,null,null,"Putenaufzucht bis 5 Wochen",null,1.1000000000000001,2.2000000000000002,null,null,2.2000000000000002]
["Mastputen","Tage Stall",null,null,null,null,null,null,{"$f":"IF(B36>0,F35*P30/1000/30*B36,F35*P30/1000*(I6+4))","v":0}," Kaninchen (! Zucht-  und Mast geschl. System, je Häsin!)",2.5000000000000001E-2,101.3,109.6,74.599999999999994,33.9,82.2,47.5]
["Hähne bis 21 Wochen",null,{"$f":"IF(D35+E35+F35=C35,\"\",D35+E35+F35-C35)","v":""},null,null,null,null,null,null,"Mastkaninchen",2.0999999999999999E-3,9.3800000000000008,10.4,6.88,3.1,9,4.4000000000000004]
["Mastputen","Tage Stall",null,null,null,null,null,null,{"$f":"IF(B38>0,F37*P31/1000/30*B38,F37*P31/1000*(I6+4))","v":0},"Zuchtkaninchen mit Absetzer",1.3299999999999999E-2,23.25,25.8,17,7.7,21,10.8]
["Hennen ab 6. Woche",null,{"$f":"IF(D37+E37+F37=C37,\"\",D37+E37+F37-C37)","v":""},null,null,null,null,null,null,null,null,null,null,null,"800kg/m³"]
["Mastputen","Tage Stall",null,null,null,null,null,null,{"$f":"IF(B40>0,F39*P32/1000/30*B40,F39*P32/1000*(I6+4))","v":0}]
["Hähne ab 6. Woche",null,{"$f":"IF(D39+E39+F39=C39,\"\",D39+E39+F39-C39)","v":""},null,null,null,null,null,null,null,null,null,null,"33 Tage"]
["Mastputen","Tage Stall",null,null,null,null,null,null,{"$f":"IF(B42>0,F41*P33/1000/30*B42,F41*P33/1000*(I6+4))","v":0},null,null,null,null,"2 Monate"]
["gem.-geschl. Aufzucht u. Mast",null,{"$f":"IF(D41+E41+F41=C41,\"\",D41+E41+F41-C41)","v":""},null,null,null,null,null,null,null,null,null,null,"3 Monate"]
["Putenaufzucht bis 5 Wochen",null,null,null,null,null,null,null,{"$f":"F43*P34/1000*(I6+4)","v":0},null,null,null,null,"4 Monate"]
[null,null,{"$f":"IF(D43+E43+F43=C43,\"\",D43+E43+F43-C43)","v":""},null,null,null,null,null,null,null,null,null,null,"5 Monate"]
["Zuchtkaninchen ",null,null,null,null,null,{"$f":"D45*N37/1000*(G6+5)","v":0},{"$f":"E45*O35/1000*(H6+4)","v":0},{"$f":"F45*P35/1000*(I6+4)","v":0},null,null,null,null,"6 Monate"]
["mit Absetzern",null,{"$f":"IF(D45+E45+F45=C45,\"\",D45+E45+F45-C45)","v":""},null,null,null,{"$f":"E45*Q37/1000*(G6+5)","v":0},null,null,null,null,null,null,"7 Monate"]
["Mastkaninchen",null,null,null,null,null,{"$f":"D47*N36/1000*(G6+5)","v":0},{"$f":"E47*O36/1000*(H6+4)","v":0},{"$f":"F47*P36/1000*(I6+3)","v":0},null,null,null,null,"8 Monate"]
[null,null,{"$f":"IF(D47+E47+F47=C47,\"\",D47+E47+F47-C47)","v":""},null,null,null,{"$f":"E47*Q36/1000*(G6+5)","v":0},null,null,null,null,null,null,"9 Monate"]
["Kaninchen, einschl. Nachzucht",null,null,null,null,null,{"$f":"D49*N35/1000*(G6+5)","v":0},{"$f":"E49*O37/1000*(H6+4)","v":0},{"$f":"F49*P37/1000*(I6+3)","v":0},null,null,null,null,"10 Monate"]
["geschlossenes System",null,{"$f":"IF(D49+E49+F49=C49,\"\",D49+E49+F49-C49)","v":""},null,null,null,{"$f":"E49*Q35/1000*(G6+5)","v":0},null,null,null,null,null,null,"11 Monate"]
["Summe",null,{"$f":"C7+C9+C11+C13+C15+C17+C19+C21+C23+C25+C27+C29+C31+C33+C35+C37+C39+C41+C43+C45+C47+C49","v":0},null,null,null,{"$f":"SUM(G7:G50)","v":0},{"$f":"H49+H47+H45+H7+H9","v":0},{"$f":"SUM(I7:I49)","v":0},null,null,null,null,"12 Monate"]
["Kommentar:"]

{"sheet":"Lager_Schaf","index":6,"n_rows":37,"n_cols":14,"rows_kept":37,"cut":false,"hidden":false,"merged":[[33,0,44,6],[1,5,1,6]]}
["Flüssig- und Festmistanfall für Schafe und Pferde",null,null,null,null,{"$f":"Deckblatt!H3","v":"Version \"2017-3.1\""},{"$f":"Deckblatt!O31","v":"2024-05-05"}]
["Betrieb:",{"$f":"Deckblatt!E15","v":"Testbetrieb"},null,null,"Untern.-Nr.:",{"$f":"Deckblatt!E25","v":141234567890}]
["mitwirk. Unternehmen:",{"$f":"Deckblatt!E6","v":"LfULG"},null,null,"Bearbeiter:",{"$f":"Deckblatt!E8","v":"Administrator"}]
[null,null,"Flachstreu","Tiefstreu","Anfall in m³","Anfall in m³",null,null,null,null,"Frischmist",null,"Tiefstreu"]
[null,"Tierplätze","(Frischmist)",null,"Festmist","Reinig.-wasser",null,null,null,"GV","t/Tier","m³/Tier","m³/Tier"]
[null,"gesamt","Tierplätze","Tierplätze",{"$f":"Betrieb!A6","v":1},1,null,null," Schafe unter 1 Jahr  und Hammel",0.1,7.3999999999999996E-2,0.114,0.08]
["Mutterschafe",null,null,null,{"$f":"(C7*L7*VLOOKUP(E6,K26:L31,2)+IF(E6<2,D7*L7,D7*M7))*(E$6+1)","v":0},null,null,null," Mutterschafe",0.15,9.1999999999999998E-2,0.14199999999999999,0.1]
["Melkhausabwasser in Jauche einleiten ?",null,null,null,2,{"$f":"IF(E8=1,N12*(F6+5)*(C7+D7),0)","v":0}]
["weibl. Schafe > 1Jahr",null,null,null,{"$f":"(C9*L10*VLOOKUP(E6,K26:L31,2)+IF(E6<2,D9*L10,D9*M10))*(E$6+1)","v":0},null,null,null,"Mastlämmer",0.06,4.5999999999999999E-2,7.0999999999999994E-2,0.05]
["(Zutreter)",null,null,null,null,null,null,null," Weibliche Schafe über 1 Jahr  (Zutreter)",0.15,8.3000000000000004E-2,0.128,0.09]
["Schafe < 1 Jahr",null,null,null,{"$f":"(C11*L6*VLOOKUP(E6,K26:L31,2)+IF(E6<2,D11*L6,D11*M6))*(E$6+1)","v":0},null,null,null," Andere Schafe über 1 Jahr (Böcke)",0.2,0.11,0.16900000000000001,0.12]
["und Hammel",null,null,null,null,null,null,null," Mutterziegen",0.15,8.3000000000000004E-2,0.128,0.09,4.4999999999999998E-2]
["and. Schafe >1 Jahr",null,null,null,{"$f":"(C13*L11*VLOOKUP(E6,K26:L31,2)+IF(E6<2,D13*L11,D13*M11))*(E$6+1)","v":0},null,null,null," andere Ziegen (unter 1 Jahr)",0.15,5.5E-2,8.5000000000000006E-2,0.06]
["(Böcke)"]
["Mastlämmer",null,null,null,{"$f":"(C15*L9*VLOOKUP(E6,K26:L31,2)+IF(E6<2,D15*L9,D15*M9))*(E$6+1)","v":0},null,null,null," Pferde unter 6 Monate, Ponys, Kleinpferde",0.5,0.28299999999999997,0.47,0.35]
[null,null,null,null,null,null,null,null,"Pferde 6 Monate- 3Jahre",0.75,0.56599999999999995,0.94,0.7]
["Summe Schafe",null,null,null,{"$f":"E7+E9+E11+E13+E15","v":0}]
[]
["Mutterziegen",null,null,null,{"$f":"(C19*L12*VLOOKUP(E6,K26:L31,2)+IF(E6<2,D19*L12,D19*M12))*(E$6+1)","v":0},null,null,null," Pferde über 3 Jahre ",1.1000000000000001,0.93300000000000005,1.6,1.1000000000000001]
["Melkhausabwasser in Jauche einleiten ?",null,null,null,1,{"$f":"IF(E20=1,N12*(F6+5)*(C19+D19),0)","v":0},null,null,null,"ja"]
["andere Ziegen",null,null,null,{"$f":"(C21*L13*VLOOKUP(E6,K26:L31,2)+IF(E6<2,D21*L13,D21*M13))*(E$6+1)","v":0},null,null,null,null,"nein"]
["(unter 1 Jahr)"]
["Summe Ziegen",null,null,null,{"$f":"E19+E21","v":0}]
[]
["Pferde ",null,null,null,{"$f":"(C25*L19*VLOOKUP(E6,K26:L31,2)+IF(E6<2,D25*L19,D25*M19))*(E$6+1)","v":0}]
["über 3 Jahre"]
["Pferde 6 Mo.-3 Jahre",null,null,null,{"$f":"(C27*L16*VLOOKUP(E6,K26:L31,2)+IF(E6<2,D27*L16,D27*M16))*(E$6+1)","v":0},null,null,null,null,"2 Monate",1,1]
["Kleinpferde",null,null,null,null,null,null,null,null,"3 Monate",2,0.86599999999999999]
["Pferde unter 6 Mon.",null,null,null,{"$f":"(C29*L15*VLOOKUP(E6,K26:L31,2)+IF(E6<2,D29*L15,D29*M15))*(E$6+1)","v":0},null,null,null,null,"4 Monate",3,0.8]
["Ponys, Esel",null,null,null,null,null,null,null,null,"5 Monate",4,0.76]
["Summe Pferde",null,null,null,{"$f":"E29+E27+E25","v":0},null,null,null,null,"6 Monate",5,0.73]
["Summe ",{"$f":"B29+B27+B25+B21+B19+B15+B13+B11+B9+B7","v":0},null,null,{"$f":"E31+E23+E17","v":0},{"$f":"SUM(F7:F30)","v":0},null,null,null,"7 Monate",6,0.73]
["Kommentar:",null,null,null,null,null,null,null,null,"8 Monate",7]
[null,null,null,null,null,null,null,null,null,"9 Monate",8]
[null,null,null,null,null,null,null,null,null,"10 Monate",9]
[null,null,null,null,null,null,null,null,null,"11 Monate",10]
[null,null,null,null,null,null,null,null,null,"12 Monate",11]

{"sheet":"Hilfe","index":7,"n_rows":51,"n_cols":3,"rows_kept":51,"cut":false,"hidden":false,"merged":[[2,0,2,2],[3,0,3,2],[1,0,1,1]]}
["Hinweise und Erläuterungen zur Programmbenutzung"]
["Erklärung:"]
["Das EXCEL-Programm zur Ermittlung der Lagerkapazität von Dung wurde mit großer Sorgfalt erstellt. Trotzdem können Fehler bei der Programmierung nicht ausgeschlossen werden. Das Landesamt für Umwelt, Landwirtschaft und Geologie (LfULG) übernimmt keinerlei Haftung für Schäden und Nachteile, die aus Programmfehlern, fehlerhaft hinterlegten Daten, fehlerhafter Programmanwendung oder Programmdokumentation einschließlich unzureichender, fehlerhafter oder missverständlicher Anwendungshinweise, fehlender Programmaktualisierung etc. resultieren. Weiterhin weisen wir darauf hin, dass das Programm nur als Hilfsmittel zur Vereinfachung der Verwaltungsverfahren, nicht aber als offizielles Dokument oder Instrument zur Verfügung gestellt wird. Wir garantieren nicht, dass immer die aktuellste Version des Programms zur Verfügung gestellt wird."]
["Sächsisches Landesamt für Umwelt, Landwirtschaft und Geologie (LfULG) 2017"]
[]
["Zweck",null,"Das Programm \"Lagerka\" dient zur Ermittlung und zum Nachweis der Lagerkapazit für Wirtschaftsdünger bei der Förderung landwirtschaftlicher Unternehmen, bei Genehmigungsverfahren sowie Kontrollen im Rahmen der Konditionalität"]
["Version",null,"Die Version Lagerka  2017 - 3.1 ist rechentechnisch identisch mit der Version 2017 - 2.8. Bei der Version 2017 -3.1 wurden aus Datenschutzgründen MAKROS entfernt, die einer Versendung mit Email-Programmen entgegenstanden. Weiterhin entfallen die Übergangsregelung zur Festmistlagerung unterhalb von zwei Monaten sowie die Tabellen Tipla_Mi und Tipla_S. "]
[]
["Exceleinstellungen"]
["Makroeinstellungen: ",null,"Die Excelvorlage enthält Makros.Nach dem Downlaod der Vorlage wird emphlen, diese mit \"speichern unter: Exelarbeismappe mit Makros\" zu speichern. Die automatische Speicherung der erzeugten Arbeitsmappe aus der Vorlage erfolgt sonst nur als Arbeitsmappe. Damit gehen die Makros verloren.  Bitte Sicherheitseinstellungen im Trustcentrum beachten!"]
[]
["Aufbau",null,"Das Programm ist im Seitenmodus aufgebaut. Sind mehrere Tabellen auf einem Arbeitsblatt, entspricht jede Tabelle einer Seite"]
[]
["Tabellen"]
["Deckblatt:",null,"Angaben zum Betrieb und zum Bearbeiter"]
["Lager_Ri:",null,"Tabellenblätter für Dunganfall für Rinder und Anfall Silosickersaft"]
["Lager_Schwein:",null,"Dunganfall für Schweine"]
["Lager_Schaf:",null,"Dunganfall für Schafe, Ziegen und Pferde"]
["Lager_Gefl.:",null,"Dunganfall für Geflügel und Kaninchen"]
["Koferm:",null,"Anfallsberechnung von Biogasfugat aus Kofermenten, Berechnung von Phasenanteilen bei der Gärrest- bzw. Gülleseparation"]
["Betrieb: ",null,"Zusammenfassung der Wirtschaftsdüngeranfallswerte aus den Lager_*-Tabellen und der Tabelle Kofermente, Berechnung der Lagerkapazität und der Lagerdauer, Berücksichtigung von Freibord, Niederschlägen und ggf. Restfüllstand"]
["JNS-SN:",null,"Hilfstabelle zur Ermittlung des Jahresniederschlages für die Gemeinden in Sachsen. Die Niederschläge sind das 30-jährige Mittel von 1950- 1980. Weiterhin sind neuere Tabellen für die Jahre 1961 -1990 und 1981 - 2010 für die Wetterstationen des DWD in Sachsen enthalten."]
["WD-Anfall:",null,"Die Tabelle enthält die monatlichen Anfallsmengen"]
[]
["Bedienungshinweise"]
["Deckblatt:",null,"Im Deckblatt sollten mindestens die Zeilen: Betrieb, Datum, Jahresniederschlag, Bearbeiter ausgefüllt werden. Diese Daten werden automatisch in die weiteren Tabellen übernommen."]
[]
["Kommentare:",null,"Zur Hilfestellung und Erläuterung befinden sich an einigen Zellen rechts oben rote Ecken. Beim Überstreichen der Zelle mit dem Cursors werden die Kommentare sichtbar."]
[]
["Pull-Down-Schalter:",null,"Die Schalter gestatten eine Optionsauswahl. Achten Sie insbesondere bei den Schaltern zur Lagerdauer auf richtige Einstellungen."]
[]
["Übernahme-Schalter:",null,"Diese Schalter übernehmen Zahlenwerte aus anderen Tabellen"]
[]
["Sprungschalter:",null,"Mit den Sprungschaltern ist der Sprung in ein anderes Tabellenblatt möglich. Sie ergänzen das Karteisystem unterhalb des Excel-Arbeitsblattes"]
[]
["Löschschalter:",null,"Die Schalter ermöglichen die Löschung der Eingaben innerhalb einer Tabelle. \nAchtung!!!: Löschungen per Makro sind nicht rückgängig zu machen!"]
[]
["Bedeutung der Zellfarben:",null,"Hellblaue Zellen sind Eingabezellen, nur in diese Zellen kann geschrieben werden."]
[null,null,"Gelbe Zellen sind (Zwischen-)Ergebniszellen - gesperrt"]
[null,null,"Hellbraune Zellen sind  Ergebnisszellen - gesperrt"]
[null,null,"Alle anderen Farben dienen optischen Abgrenzungen - gesperrt"]
[]
["weitere Hinweise",null,"In der Tabelle \"Betrieb\" besteht die Möglichkeit die Anfallsmengen von Dung, Silosickersaft und Fugat aus Kofermenten mittels Schalter zu übernehmen. Gleichzeitig können die Anfallsmengen aber auch direkt eingetragen werden. Bitte berücksichtigen Sie dabei den eingestellten Lagerzeitraum (Schalterstellung)! Dies gilt auch für entsprechende Eingaben zum Minder- bzw. Mehranfall."]
[]
[null,null,"Nach Düngeverordnung darf Festmist von Huf- und Klauentieren vom 15. Dezember bis einschließlich 15. Januar nicht ausgebracht werden. Darüber hinaus ist nach DüV §12, Abs. 4 eine Lagerkapazität von mindestens 2 Monaten für Festmist von Huf- und Klauentieren erforderlich."]
[]
[null,null,"In der Tabelle \"Betrieb - Festmistanfall\" sind neue Schalter für die Zuordnung von einzelnen Tierarten auf bestimmte Lagerstätten - hier speziell die Lagerstätte \"Stall\" bei Tiefstreuverfahren - angeordnet worden. Dies soll  ausschließen, dass Einzelställe mit einer Lagerkapazität über 2 Monate ab 2020 rechnerisch zum Lager für Festmiste anderer Tiergruppen werden."]
[]
[null,null,"Da die Lagerdauer von 2 Monaten nur für Festmiste von Huf- und Klauentieren gilt, ergeben sich für andere Formen von Festmist auch andere Lagerkapazitäten:\n- für Geflügeltrockenkot und Geflügelmist mindestens 5 Monate\n- für Feststoffe von Gülle und Gärresten mindestens 6 Monate."]
[]
[null,null,"In den Tabellen \"Rind\", \"Geflügel\" und \"Schaf\" kann für einige Tiergruppen die Stallhaltungsdauer in Tagen angegeben werden. Ist die Dauer kürzer als die Schalterstellung 6 ...12 Monate, wird der Flüssigmistanfall auf die angegebene Tageszahl reduziert. Nach Düngeverordnung 2017 betrifft dies den Zeitraum vom 01.Oktober bis 01.April. Diese Angaben sind entsprechend gesondert zu begründen. \nDa die Düngeverordnung 2017 für Festmist von Huf-und Klauentieren nur noch eine Lagerkapazität von mind. 2 Monate vorsieht, hat die Stallhaltungsdauer auf den Festmistanfall hier keinen Einfluss."]

{"sheet":"JNS-SN","index":8,"n_rows":986,"n_cols":13,"rows_kept":986,"cut":false,"hidden":false,"merged":[]}
["FBZ/ISS LfULG","Gemeinde d. ehem. DDR","Höhe              [m ü. NN]","Niederschlag [mm]","Temperatur [°C]","Bemerkung",null,"Wetterstation alphabetisch","Höhe              [m ü. NN]","Niederschlag [mm]",null,"Niederschlag [mm]","Bemerkung"]
["Quelle: Deutscher Wetterdienst",null,null,"Mittelwerte von 1951-1979",null,null,null,"Quelle: Deutscher Wetterdienst",null,"Mittelwerte von 1961-1990",null,"Mittelwerte von 1981-2010"]
["Döbeln","Beicha",223,680,8.1999999999999993,null,null,"Adorf                                   ",480,718.9,null,746.5]
["Döbeln","Bockelwitz",216,713,8.1,null,null,"Albrechtshain                           ",128,577.29999999999995,null,600.29999999999995]
["Döbeln","Borna",117,612,8.5,null,null,"Altenberg-Kipsdorf                      ",550,925.5,null,971.6]
["Döbeln","Cavertitz",114,630,8.4,null,null,"Altenberg-Schellerhau                   ",778,984.1,null,969.6]
["Döbeln","Collm",180,731,8.1999999999999993,null,null,"Altgeringswalde",290,691.1,null," ---"]
["Döbeln","Dahlen, Stadt",136,662,8.5,null,null,"Altmörbitz (TS Schömbach)               ",207,623.5,null,649.70000000000005]
["Döbeln","Döbeln, Stadt",211,706,8.1999999999999993,null,null,"Amtsberg-Weißbach                       ",410,848.6,null,873]
["Döbeln","Ebersbach",232,733,8,null,null,"Annaberg-Buchholz                       ",630,834.2,null,864.9]
["Döbeln","Gersdorf",261,714,8,null,null,"Aue                                     ",393,791.6,null,842]
["Döbeln","Großweitzschen",228,725,8.1,null,null,"Augustusburg                            ",451,809.1,null,864]
["Döbeln","Hartha, Stadt",267,724,7.9,null,null,"Bahretal-Ottendorf                      ",273,630.29999999999995,null,669.9]
["Döbeln","Kiebitz",200,730,8.1999999999999993,null,null,"Belgern                                 ",120,588.70000000000005,null,605.79999999999995]
["Döbeln","Lampertswalde",120,670,8.4,null,null,"Belgershain                             ",150,589.6,null,629]
["Döbeln","Leisnig, Stadt",201,680,8.3000000000000007,null,null,"Belgershain-Rohrbach                    ",141," ---",null,630.79999999999995]
["Döbeln","Liebschützberg",125,637,8.5,null,null,"Bernbruch                               ",168,629.6,null,663.6]
["Döbeln","Liptitz",160,710,8,null,null,"Bernsdorf, Krs, Kamenz                  ",145,652.79999999999995,null,677]
["Döbeln","Luppa",141,674,8.4,null,null,"Berthelsdorf                            ",342,819,null,821.1]
["Döbeln","Lüttewitz",251,713,8.1,null,null,"Bertsdorf                               ",285," ---",null,677.2]
["Döbeln","Mochau",230,705,8.1999999999999993,null,null,"Bertsdorf-Hörnitz                       ",270.5," ---",null,672]
["Döbeln","Mügeln, Stadt",152,685,8.3000000000000007,null,null,"Bielatal                                ",364,740.9,null,789.8]
["Döbeln","Naundorf",135,655,8.6,null,null,"Bischofswerda                           ",300,763.5,null,769.3]
["Döbeln","Niederstriegis",240,740,7.9,null,null,"Bobenneukirchen",453,645.70000000000005,null," ---"]
["Döbeln","Noschkowitz",185,685,8.1999999999999993,null,null,"Bockau                                  ",509,938.2,null,968.2]
["Döbeln","Oschatz, Stadt",128,665,8.5,null,null,"Boerln",145,609.4,null," ---"]
["Döbeln","Ostrau",156,677,8.4,null,null,"Borna (Speicherbecken)                  ",135,555.29999999999995,null,598]
["Döbeln","Polkenberg",183,679,8.3000000000000007,null,null,"Boxberg                                 ",125.5,601.4,null,641]
["Döbeln","Roßwein, Stadt",275,737,7.9,null,null,"Bräunsdorf, Krs. Chemnitz",345,733.4,null," ---"]
["Döbeln","Schrebitz",201,717,8,null,null,"Brambach, Bad Raun-Gürth                ",600,665.9,null,757.8]
["Döbeln","Sornzig-Ablaß",185,705,8.1999999999999993,null,null,"Braunsdorf                              ",300,810.1,null,812.5]
["Döbeln","Waldheim, Stadt",260,767,7.9,null,null,"Burghammer-Burgneudorf                  ",110,632.70000000000005,null,666.4]
["Döbeln","Wermsdorf",170,712,8.1,null,null,"Burghammer-Burgneudorf 1                ",107,617.20000000000005,null,649.79999999999995]
["Döbeln","Ziegra-Knobelsdorf",227,732,8.1,null,null,"Burgstädt                               ",324.5,685,null,725.9]
["Döbeln","Zschaitz-Ottewig",216,688,8.1999999999999993,null,null,"Burgstein-Grobau                        ",570,739.4,null,739]
[null,null,null,null,null,null,null,"Burkau-Kleinhänchen                     ",204.5,736.9,null,734.5]
["Großenhain","Adelsdorf",120,640,8.6,null,null,"Burkhardtswald-Munzig",null,665.8,null," ---"]
["Großenhain","Altfranken",260,700,8,null,null,"Burkhardtsdorf                          ",405,836.7,null,866.5]
["Großenhain","Baßlitz",150,615,8.6,null,null,"Callenberg                              ",325,676.3,null,697.5]
["Großenhain","Beiersdorf",165,670,8.4,null,null,"Carlsfeld                               ",895.3,1229.8,null,1205]
["Großenhain","Cossebaude",163,609,8.5,null,null,"Carlsfeld Talsperre (Weiterwiese )      ",914,1219,null,1242.4000000000001]
["Großenhain","Coswig, Stadt",108,635,8.8000000000000007,null,null,"Chemnitz                                ",416.1,700.7,null,722.5]
["Großenhain","Deutschenbora",240,750,7.7,null,null,"Chemnitz-Küchwald                       ",325,774.7,null,800.8]
["Großenhain","Diera",141,593,8.6,null,null,"Colditz                                 ",192,626.4,null,672.3]
["Großenhain","Diesbar-Seußlitz",119,576,8.6999999999999993,null,null,"Collmberg                               ",314," ---",null,686.2]
["Großenhain","Dresden, Stadt",113,656,8.4,null,null,"Coswig                                  ",110,589.1,null,610]
["Großenhain","Ebersbach",141,674,8.4,null,null,"Crimmitschau                            ",269,631.6,null,658.8]
["Großenhain","Folbern",125,660,8.6,null,null,"Crimmitschau-Blankenha,                 ",310,666.4,null,692.9]
["Großenhain","Gauernitz",120,670,8.5,null,null,"Crimmitschau-Mannichswalde              ",328," ---",null,689]
["Großenhain","Glaubitz",103,580,8.6,null,null,"Crottendorf                             ",652,883.7,null,930]
["Großenhain","Gohlis",95,550,8.6,null,null,"Dahlen-Großböhla                        ",138,596.29999999999995,null,612.29999999999995]
["Großenhain","Gompitz",270,710,7.9,null,null,"Deutschneudorf-Brüderwiese              ",689," ---",null,997]
["Großenhain","Gröditz, Stadt",95,600,8.8000000000000007,null,null,"Diesbar-Seußlitz                        ",100,583.4,null,612.70000000000005]
["Großenhain","Großdittmannsdorf",170,700,8.1999999999999993,null,null,"Dippoldiswalde-Reinberg                 ",358.5,760.1,null,781.6]
["Großenhain","Großenhain, Stadt",125,631,8.6,null,null,"Döbeln                                  ",201," ---",null,688.8]
["Großenhain","Helbigsdorf-Blankenstein",282,717,7.4,null,null,"Dorfchemnitz-Wolfsgrund                 ",535,893.3,null,955.3]
["Großenhain","Heynitz",235,717,7.9,null,null,"Dörnthal                                ",558,799.2,null,844.6]
["Großenhain","Hirschstein",108,560,8.6,null,null,"Drebach                                 ",490,952.1,null,917]
["Großenhain","Käbschütztal",187,669,8.1,null,null,"Drebligar                               ",85,561.70000000000005,null,513.6]
["Großenhain","Ketzerbachtal",243,702,8.1,null,null,"Dresden (Mitte)                         ",112,583.70000000000005,null,606.6]
["Großenhain","Klipphausen",245,705,7.9,null,null,"Dresden-Gohlis                          ",107,556.20000000000005,null,580.79999999999995]
["Großenhain","Kraußnitz",120,650,8.4,null,null,"Dresden-Hosterwitz                      ",112,647.4,null,658.9]
["Großenhain","Lampertswalde",140,680,8.6,null,null,"Dresden-Klotzsche                       ",227.6,666.7,null,656.1]
["Großenhain","Langebrück",215,720,8,null,null,"Dresden-Leutewitz                       ",147," ---",null,657.3]
["Großenhain","Lenz",135,650,8.6,null,null,"Dresden-Strehlen                        ",119," ---",null,635]
["Großenhain","Leuben-Schleinitz",194,668,8.3000000000000007,null,null,"Dröda (Talsperre Feilebach)             ",440,647.20000000000005,null,665.6]
["Großenhain","Leutewitz",100,520,9.1999999999999993,null,null,"Düben/Mulde, Bad                        ",89,582.4,null,603.5]
["Großenhain","Liegau-Augustusbad",220,760,7.8,null,null,"Dürrhennersdorf                         ",331.5," ---",null,756]
["Großenhain","Lommatzsch, Stadt",162,628,8.5,null,null,"Eckartsberg                             ",262," ---",null,671.3]
["Großenhain","Mehltheuer",137,563,8.6999999999999993,null,null,"Eibau-Walddorf                          ",444,785.4,null,779.2]
["Großenhain","Meißen, Stadt",120,632,8.5,null,null,"Eibenstock                              ",630,884.4,null,919.6]
["Großenhain","Mobschatz",238,686,8.1,null,null,"Eibenstock (Talsperre)                  ",543,910.5,null,964]
["Großenhain","Moritzburg",175,680,8.1999999999999993,null,null,"Eich                                    ",485,786.9,null,778.1]
["Großenhain","Naunhof",175,680,8.1999999999999993,null,null,"Eichigt                                 ",450,680.2,null,713.9]
["Großenhain","Nauwalde",93,571,8.6,null,null,"Eichigt-Tiefenbrunn                     ",592.5," ---",null,734.8]
["Großenhain","Niederau",139,628,8.6,null,null,"Eilenburg                               ",106.9,574,null,585.4]
["Großenhain","Nossen, Stadt",259,750,7.8,null,null,"Einsiedel (Talsperre)                   ",375,832.3,null,808.4]
["Großenhain","Nünchritz",113,582,8.6,null,null,"Ellefeld                                ",515,834.3,null,878.3]
["Großenhain","Plotitz",152,626,8.6,null,null,"Elster, Bad-Sohl                        ",557.5,759.7,null,790.7]
["Großenhain","Ponickau",136,665,8.4,null,null,"Elsterberg                              ",290,625.29999999999995,null,638.29999999999995]
["Großenhain","Priestewitz",165,593,8.6,null,null,"Elsterheide-Geierswalde                 ",108,571.1,null,631]
["Großenhain","Promnitztal",167,686,8.1999999999999993,null,null,"Elstertrebnitz                          ",132,581.20000000000005,null,602.29999999999995]
["Großenhain","Quersa-Brockwitz",131,667,8.6,null,null,"Elterlein                               ",600,959.4,null,961]
["Großenhain","Radebeul, Stadt",120,670,8.5,null,null,"Eppendorf                               ",448,788.7,null,908.4]
["Großenhain","Radeburg, Stadt",164,689,8.1999999999999993,null,null,"Erlbach-Eubabrunn                       ",565,785.7,null,847.5]
["Großenhain","Reichenberg",203,680,8.1999999999999993,null,null,"Falkenberg                              ",115,594.9,null,638.6]
["Großenhain","Reinersdorf",151,670,8.6,null,null,"Falkenstein (Talsperre)                 ",540,862.6,null,876.9]
["Großenhain","Riesa, Stadt",128,565,8.6999999999999993,null,null,"Fichtelberg                             ",1213,1117.7,null,1125.8]
["Großenhain","Röderau-Bobersen",100,556,8.6,null,null,"Flöha                                   ",270,771.3,null,807.2]
["Großenhain","Röderaue",100,625,8.6,null,null,"Flößberg                                ",164,607.20000000000005,null,646.20000000000005]
["Großenhain","Sacka",164,697,8.5,null,null,"Frankenberg-Altenhain                   ",322.5," ---",null,831]
["Großenhain","Scharfenberg",208,656,8.4,null,null,"Frankenstein                            ",400,768,null,805.8]
["Großenhain","Schönborn",160,670,8.6,null,null,"Fraureuth                               ",315,681.9,null,709.5]
["Großenhain","Schönborn b. Radeberg",240,740,7.8,null,null,"Freiberg                                ",416,763,null,842.6]
["Großenhain","Schönfeld",143,675,8.6,null,null,"Frohburg-Gnandstein                     ",203," ---",null,665]
["Großenhain","Schönfeld-Weißig",287,731,7.9,null,null,"Fuchshain                               ",138,586.5,null,605]
["Großenhain","Seerhausen",115,560,8.8000000000000007,null,null,"Fürstenwalde                            ",679,657.8,null,684.4]
["Großenhain","Stauchitz",127,593,8.6999999999999993,null,null,"Gablenz",507,834.2,null," ---"]
["Großenhain","Steinbach",150,680,8.1999999999999993,null,null,"Garsebach bei Meißen                    ",158,628.4,null,625]
["Großenhain","Strehla, Stadt",106,547,8.8000000000000007,null,null,"Geising                                 ",578,912.4,null,1028.4000000000001]
["Großenhain","Strießen",138,600,8.6,null,null,"Geisingberg                             ",823," ---",null,1032]
["Großenhain","Tanneberg",265,700,7.7,null,null,"Geringswalde-Altgeringswalde            ",295.5," ---",null,741.4]
["Großenhain","Taubenheim",226,693,8,null,null,"Glashütte                               ",368," ---",null,795]
["Großenhain","Tauscha",165,700,8.4,null,null,"Glashütte-Schlottwitz                   ",235,724.5,null,753.6]
["Großenhain","Thiendorf",143,700,8.5,null,null,"Glauchau                                ",235," ---",null,647.79999999999995]
["Großenhain","Triebischtal",244,682,7.9,null,null,"Görlitz                                 ",238.5,656.7,null,646.6]
["Großenhain","Weinböhla",115,625,8.5,null,null,"Görlitz-Kunnerwitz                      ",271,640.9,null,685.7]
["Großenhain","Weißig a. Raschütz",145,655,8.6,null,null,"Gottleuba, Bad                          ",360,741,null,793.8]
["Großenhain","Weixdorf",190,685,8.1999999999999993,null,null,"Gottleuba, Bad (TS)                     ",430,695.6,null,709.1]
["Großenhain","Weßnitz",133,657,8.6,null,null,"Graupa                                  ",183,660.6,null,684.3]
["Großenhain","Wildenhain",118,622,8.6,null,null,"Grimma                                  ",150,638.29999999999995,null,630.20000000000005]
["Großenhain","Wilsdruff, Stadt",284,746,7.5,null,null,"Grimma-Kleinbothen                      ",134," ---",null,640]
["Großenhain","Wülknitz",99,586,8.6,null,null,"Gröditz                                 ",93,486,null,575]
["Großenhain","Zabeltitz-Treugeböhla",116,639,8.6,null,null,"Groß Düben                              ",133,605.1,null,651.4]
["Großenhain","Zehren",135,558,8.6999999999999993,null,null,"Großenhain-Skassa                       ",125,543.9,null,566]
["Großenhain","Zeithain",95,560,8.6,null,null,"Großenhain-Stroga                       ",110," ---",null,589.6]
[null,null,null,null,null,null,null,"Großharthau                             ",283,760.2,null,797.3]
["Kamenz","Arnsdorf b. Dresden",262,794,7.6,null,null,"Großhartmannsdorf/Speicher              ",490,789.6,null,842.2]
["Kamenz","Bernbruch",160,740,8,null,null,"Großlehna-Altranstaedt",115,527,null," ---"]
["Kamenz","Bernsdorf, Stadt",139,641,8.5,null,null,"Großpösna-Oberholz                      ",162,567.9,null,601.5]
["Kamenz","Bischheim-Häslich",235,784,7.6,null,null,"Großröhrsdorf-Kleinröhrsdorf            ",263,780.1,null,809.8]
["Kamenz","Bluno",110,600,8.4,null,null,"Großschönau                             ",310,null,null,724]
["Kamenz","Bretnig-Hauswalde",327,850,7.4,null,null,"Grumbach                                ",290,694.5,null,728.8]
["Kamenz","Bulleritz",150,700,8.4,null,null,"Grünbach                                ",697,928,null,953.7]
["Kamenz","Burghammer",110,645,8.4,null,null,"Grünbach-Muldenberg (Talsperre)         ",710," ---",null,1046.2]
["Kamenz","Burkau",234,784,7.7,null,null,"Grünhainichen                           ",447,900.5,null,940.6]
["Kamenz","Cosel-Zeisholz",123,644,8.6,null,null,"Günsdorf                                ",549,887.3,null,917.9]
["Kamenz","Crostwitz",178,728,8,null,null,"Hähnichen                               ",155,654.9,null,670.6]
["Kamenz","Deutschbaselitz",155,690,8.1999999999999993,null,null,"Hähnichen-Trebus                        ",163," ---",null,691]
["Kamenz","Dörgenhausen",120,600,8.4,null,null,"Halbendorf/Spree                        ",142,611.5,null,643.70000000000005]
["Kamenz","Elstra, Stadt",214,779,8,null,null,"Hartha-Fördergersdorf                   ",335,757.5,null,782]
["Kamenz","Fischbach",270,820,7.6,null,null,"Hartmannsdorf bei Kirchberg             ",563,952.1,null,969.6]
["Kamenz","Geierswalde",109,590,8.1999999999999993,null,null,"Hartmannsdorf-Reichenau                 ",527,852.6,null,890]
["Kamenz","Gersdorf-Möhrsdorf",240,790,7.7,null,null,"Heidenau-Großsedlitz                    ",204,585.1,null,637.29999999999995]
["Kamenz","Groß Särchen",129,630,8.4,null,null,"Herrnhut                                ",344,687.7,null,694.3]
["Kamenz","Großerkmannsdorf",275,769,7.9,null,null,"Hinterhermsdorf                         ",385," ---",null,892]
["Kamenz","Großgrabe",150,650,8.6,null,null,"Hirschstein-Heyda                       ",130.5," ---",null,619]
["Kamenz","Großnaundorf",220,766,7.9,null,null,"Höfchen-Kriebstein Talsperre            ",212,747.4,null,727.5]
["Kamenz","Großröhrsdorf, Stadt",290,830,7.6,null,null,"Hohendubrau-Gebelzig                    ",196,648.6,null,646.1]
["Kamenz","Grüngräbchen",130,660,8.6,null,null,"Hohndorf                                ",415,766.1,null,812.4]
["Kamenz","Hermsdorf",180,730,8,null,null,"Hoyerswerda                             ",116,623.4,null,635]
["Kamenz","Höckendorf",210,750,8,null,null,"Hoyerswerda (Ph)                        ",118," ---",null,639.20000000000005]
["Kamenz","Hoyerswerda",121,607,8.4,null,null,"Jesewitz                                ",127,570.20000000000005,null,590.6]
["Kamenz","Kamenz, Stadt",199,762,7.9,null,null,"Jöhstadt                                ",715,870.4,null,927.7]
["Kamenz","Klein-Partwitz",111,600,8.4,null,null,"Jonsdorf, Kurort                        ",425," ---",null,836]
["Kamenz","Kleinröhrsdorf",260,800,7.6,null,null,"Kamenz                                  ",270," ---",null,693.5]
["Kamenz","Koblenz",129,630,8.4,null,null,"Kamenz-Cunnersdorf                      ",166," ---",null,682]
["Kamenz","Koitzsch",200,750,8,null,null,"Karsdorf                                ",403.5,692.1,null,736.8]
["Kamenz","Königsbrück, Stadt",182,729,8.1999999999999993,null,null,"Kemnitz                                 ",325,688.2,null,680.6]
["Kamenz","Laubusch",110,640,8.4,null,null,"Ketzerbachtal-Klessig                   ",213,661.3,null,707.1]
["Kamenz","Laußnitz",180,740,8,null,null,"Kirchberg                               ",380,776.6,null,825]
["Kamenz","Lauta, Stadt",115,560,8.1999999999999993,null,null,"Kirchberg-Stangengrün                   ",450,681.9,null,762]
["Kamenz","Leippe-Torno",135,600,8.4,null,null,"Kirchberg-Wolfersgrün (Talsperre)       ",354,675.8,null,729.7]
["Kamenz","Lichtenberg",285,783,7.6,null,null,"Kletzen                                 ",120,575.1,null,603.70000000000005]
["Kamenz","Lohsa",127,628,8.4,null,null,"Klingenberg Talsperre                   ",395,802.2,null,835]
["Kamenz","Lomnitz",200,750,7.9,null,null,"Klingenthal                             ",618,1160.2,null,1107.7]
["Kamenz","Lückersdorf-Gelenau",235,780,7.7,null,null,"Klingenthal-Aschberg                    ",914," ---",null,1193.0999999999999]
["Kamenz","Medingen",185,700,8.1999999999999993,null,null,"Klingenthal-Kamerun                     ",730.5," ---",null,1227]
["Kamenz","Nardt",118,650,8.4,null,null,"Klitten                                 ",132,646.1,null,653.5]
["Kamenz","Nebelschütz",179,720,8.1999999999999993,null,null,"Klitzschen bei Torgau                   ",90.4,553.79999999999995,null,586]
["Kamenz","Neukirch",167,725,8.1,null,null,"Kölsa                                   ",115,737.3,null,573.20000000000005]
["Kamenz","Neustadt",111,600,8.4,null,null,"Königshain                              ",270,600.4,null,735.8]
["Kamenz","Neuwiese",114,600,8.4,null,null,"Königswartha                            ",141.5,580.79999999999995,null,614.4]
["Kamenz","Oberlichtenau",260,780,7.7,null,null,"Krauschwitz-Klein Priebus               ",135,666.1,null,657.2]
["Kamenz","Ohorn",335,810,7,null,null,"Krensitz                                ",110,561.1,null,586]
["Kamenz","Oßling",146,608,8.6,null,null,"Kubschütz, Kr, Bautzen                  ",234,674.8,null,638]
["Kamenz","Ottendorf-Okrilla",183,727,8,null,null,"Kühnhaide                               ",715,878.5,null,964]
["Kamenz","Panschwitz-Kuckau",212,754,7.9,null,null,"Langebrück                              ",213,677.7,null,742]
["Kamenz","Pulsnitz, Stadt",285,796,7.5,null,null,"Langenbernsdorf-Trünzig                 ",355,674.5,null,646.70000000000005]
["Kamenz","Räckelwitz",171,693,8.1999999999999993,null,null,"Langenhessen (TS Koberbach)             ",275,644.4,null,645]
["Kamenz","Radeberg, Stadt",270,780,7.8,null,null,"Lauenstein                              ",502,805.3,null,863]
["Kamenz","Ralbitz-Rosenthal",143,661,8.5,null,null,"Lausick, Bad-Ebersbach                  ",222,626.5,null,711.2]
["Kamenz","Reichenbach-Reichenau",208,756,8,null,null,"Lausick, Bad-Glasten                    ",182,675.6,null,645.6]
["Kamenz","Sabrodt",113,630,8.3000000000000007,null,null,"Laußig-Durchwehna                       ",109,718.7,null,634.9]
["Kamenz","Schönteichen",169,700,8.1999999999999993,null,null,"Laußnitz-Glauschnitz                    ",167," ---",null,706.5]
["Kamenz","Schwarzkollm",125,620,8.4,null,null,"Lauta                                   ",120,587.79999999999995,null,612.6]
["Kamenz","Schwepnitz",145,700,8.4,null,null,"Leippe                                  ",147,704.9,null,721.5]
["Kamenz","Seidewinkel",116,650,8.4,null,null,"Leipzig/Halle                           ",131,512,null,527.70000000000005]
["Kamenz","Spohla",120,630,8.4,null,null,"Leipzig-Holzhausen                      ",138,584.6,null,619.29999999999995]
["Kamenz","Spreewitz",105,640,8.4,null,null,"Leipzig-Knauthain                       ",123," ---",null,592]
["Kamenz","Steina",280,796,7.4,null,null,"Leipzig-Mockau                          ",128,567.20000000000005,null,612.70000000000005]
["Kamenz","Straßgräbchen",150,650,8.6,null,null,"Lengefeld (Lautenbachtalsperre)         ",528,875.3,null,861.3]
["Kamenz","Tätzschwitz",109,600,8.5,null,null,"Lengefeld-Neunzehnhain (Talsperre)      ",422," ---",null,934.6]
["Kamenz","Ullersdorf b. Radeberg",270,760,7.6,null,null,"Lengefeld-Reifland (TS Saidenbach)      ",450,838.9,null,869]
["Kamenz","Wachau b. Radeberg",244,767,7.8,null,null,"Leuben                                  ",168,582.70000000000005,null,624.6]
["Kamenz","Wallroda",260,790,7.6,null,null,"Lichtenberg/Erzgeb, (TS)                ",518,837.3,null,913.9]
["Kamenz","Wartha",132,630,8.4,null,null,"Lichtenhain-Mittelndorf                 ",321," ---",null,839]
["Kamenz","Weißig",160,600,8.6,null,null,"Lichtenstein-Heinichsort                ",437,782.3,null,810]
["Kamenz","Wiednitz",135,640,8.4,null,null,"Lichtentanne                            ",348.5," ---",null,722]
["Kamenz","Wittichenau, Stadt",127,617,8.4,null,null,"Liebschützberg-Laas                     ",125,601.9,null,621.70000000000005]
["Kamenz","Zeißig",119,625,8.4,null,null,"Limbach-Oberfrohna-Bräunsdorf           ",345," ---",null,756.2]
["Kamenz","Zschornau-Schiedel",148,676,8.6,null,null,"Lippendorf-Kieritzsch                   ",145,583,null,628.70000000000005]
[null,null,null,null,null,null,null,"Löbau                                   ",249,661.6,null,694]
["Löbau","Bautzen, Stadt",199,741,8.1,null,null,"Lohmen/Sachsen                          ",195," ---",null,738.2]
["Löbau","Beiersdorf",390,900,6.8,null,null,"Lohsa                                   ",125,643.5,null,667]
["Löbau","Bernstadt, Stadt",280,738,7.4,null,null,"Lonnewitz                               ",130,558.79999999999995,null,591.6]
["Löbau","Berthelsdorf",281,750,7.2,null,null,"Lossatal-Voigtshain                     ",127," ---",null,605.4]
["Löbau","Bertsdorf-Hörnitz",292,811,6.7,null,null,"Machern                                 ",148,609.6,null,645]
["Löbau","Bischofswerda, Stadt",306,839,7.3,null,null,"Malter (Talsperre )                     ",340,729.9,null,757]
["Löbau","Crostau",280,800,7.2,null,null,"Marienberg                              ",639,817.7,null,865]
["Löbau","Cunewalde",284,899,6.8,null,null,"Marienberg-Reitzenhain                  ",773.5,909.6,null,935]
["Löbau","Demitz-Thumitz",251,815,7.5,null,null,"Marienberg-Rübenau                      ",727," ---",null,953]
["Löbau","Dittelsdorf",315,740,7.2,null,null,"Markersbach/Erzgeb.",487,876.3,null," ---"]
["Löbau","Dürrhennersdorf",360,880,7,null,null,"Markneukirchen                          ",555,766.1,null,782.3]
["Löbau","Ebersbach, Stadt",390,860,6.6,null,null,"Markranstädt-Großlehna                  ",118," ---",null,562]
["Löbau","Ebersdorf",300,830,7.4,null,null,"Maukendorf                              ",126,609.9,null,638]
["Löbau","Eibau",370,870,6.8,null,null,"Mehltheuer                              ",496,597.6,null,622.79999999999995]
["Löbau","Eulowitz",260,800,7.2,null,null,"Mittweida                               ",283,668.8,null,742.1]
["Löbau","Frankenthal",295,870,7.2,null,null,"Mockrehna                               ",102,581.79999999999995,null,597.70000000000005]
["Löbau","Friedersdorf",360,850,7,null,null,"Morgenröthe-Rautenkranz                 ",672,1050.4000000000001,null,1083.8]
["Löbau","Gaußig",264,816,7.4,null,null,"Moritzburg                              ",166,676.7,null,664.7]
["Löbau","Gnaschwitz-Doberschau",250,783,7.7,null,null,"Mücka                                   ",147,631.70000000000005,null,653.29999999999995]
["Löbau","Göda",204,769,8,null,null,"Mühltroff                               ",478,677.1,null,717.9]
["Löbau","Großdrebnitz",316,878,7,null,null,"Muldenberg (Talsp.)",710,1004.6,null," ---"]
["Löbau","Großdubrau",161,715,8.4,null,null,"Muskau, Bad                             ",127,612.6,null,628.79999999999995]
["Löbau","Großharthau",292,860,7.3,null,null,"Mutzschen                               ",189,625.6,null,645.9]
["Löbau","Großhennersdorf",310,760,7.4,null,null,"Narsdorf                                ",275,646.29999999999995,null,647.6]
["Löbau","Großpostwitz/O.L.",240,770,7.8,null,null,"Neißeaue                                ",180,602.29999999999995,null,646]
["Löbau","Großschönau",540,820,7,null,null,"Neugersdorf                             ",445,742.8,null,786.8]
["Löbau","Großschweidnitz",290,860,7.4,null,null,"Neuhausen/Erzgeb, (TS Rauschenbach)     ",615,974.5,null,993.5]
["Löbau","Guttau",145,706,8.4,null,null,"Neuhausen/Erzgebirge                    ",593,905.5,null,964.5]
["Löbau","Hainewalde",330,800,7,null,null,"Neukirch/Lausitz                        ",320,847.6,null,844.6]
["Löbau","Hartau",240,780,7.2,null,null,"Neukirchen-Dänkritz                     ",310,615.5,null,645.9]
["Löbau","Herrnhut, Stadt",320,816,6.8,null,null,"Neumark                                 ",378,628.29999999999995,null,697.5]
["Löbau","Hirschfelde",237,731,7.7,null,null,"Niederlichtenau                         ",254,731.4,null,771]
["Löbau","Hochkirch",261,782,7.7,null,null,"Niederoderwitz                          ",308,673.7,null,666.2]
["Löbau","Jonsdorf, Kurort",430,920,5.8,null,null,"Niederstriegis                          ",198,668.9,null,711.3]
["Löbau","Kirschau",260,820,7.4,null,null,"Niederwiesa                             ",295,687,null,712.7]
["Löbau","Kittlitz",232,745,7.8,null,null,"Nossen                                  ",306,671.3,null,753]
["Löbau","Kleinwelka",218,756,7.9,null,null,"Oberbobritzsch                          ",427,799.6,null,844.6]
["Löbau","Königswartha",140,643,8.4,null,null,"Oberlichtenau-Niederlichtenau           ",220,747,null,753.7]
["Löbau","Kottmarsdorf",420,890,6.7,null,null,"Oberschöna-Bräunsdorf                   ",390,745.6,null,780.9]
["Löbau","Kubschütz",207,767,8.1,null,null,"Obersteina                              ",185,630,null,612.9]
["Löbau","Lawalde",341,889,7,null,null,"Obervogelgesang                         ",120,678.7,null,709.3]
["Löbau","Leutersdorf",400,860,6.6,null,null,"Oberwiesenthal, Kurort                  ",850,1058.7,null,1043.9000000000001]
["Löbau","Löbau, Stadt",288,800,7.4,null,null,"Oederan                                 ",383,789.7,null,888]
["Löbau","Malschwitz",153,724,8.3000000000000007,null,null,"Oelsen                                  ",555,682.4,null,739.8]
["Löbau","Milkel",142,678,8.4,null,null,"Oelsnitz/Vogtl, (TS Pirk)               ",407,664.9,null,624.70000000000005]
["Löbau","Mittelherwigsdorf",313,737,7.3,null,null,"Oelsnitz/Vogtland                       ",434.5,604.1,null,670.1]
["Löbau","Neschwitz",155,677,8.1999999999999993,null,null,"Olbernhau                               ",532,856.1,null,923.2]
["Löbau","Neueibau",390,860,6.7,null,null,"Olbersdorf                              ",305,606.29999999999995,null,716.6]
["Löbau","Neugersdorf, Stadt",405,860,6.4,null,null,"Oppach                                  ",320,753.5,null,791]
["Löbau","Neukirch/Lausitz",320,950,6.8,null,null,"Oschatz                                 ",150,570.4,null,572.20000000000005]
["Löbau","Neusalza-Spremberg, Stadt",350,840,7,null,null,"Ostrau                                  ",160,588.79999999999995,null,608.4]
["Löbau","Niedercunnersdorf",320,870,7.2,null,null,"Ostritz                                 ",204," ---",null,636]
["Löbau","Niederoderwitz",310,780,7.2,null,null,"Pausa-Unterreichenau                    ",442,647.6,null,684.9]
["Löbau","Obercunnersdorf",370,880,6.6,null,null,"Pausa-Wallengrün                        ",407,656.3,null,676.7]
["Löbau","Obergurig",220,840,7.6,null,null,"Pegau                                   ",128," ---",null,595]
["Löbau","Oberoderwitz",320,830,7.6,null,null,"Pirna                                   ",123,596.29999999999995,null,633.5]
["Löbau","Olbersdorf",270,750,7.6,null,null,"Pirna-Neundorf                          ",150,624.1,null,679.3]
["Löbau","Oppach",350,850,7.2,null,null,"Plauen                                  ",387.1,581.1,null,616]
["Löbau","Ostritz,  Stadt",216,701,7.7,null,null,"Pleißa                                  ",388,806.2,null,838.1]
["Löbau","Ottenhain",320,845,7.1,null,null,"Plotzen-Sornßig                         ",330,728.6,null,779.5]
["Löbau","Oybin, Kurort",463,920,5.8,null,null,"Pockau                                  ",417,846.6,null,893.2]
["Löbau","Puschwitz",170,690,8,null,null,"Pockau-Forchheim                        ",464,859,null,842]
["Löbau","Radibor",160,703,8.4,null,null,"Pöhl-Jocketa (TS)                       ",380,649.9,null,638.9]
["Löbau","Rammenau",320,840,7.4,null,null,"Polenz                                  ",335,828,null,855.5]
["Löbau","Ringenhain",390,980,6.6,null,null,"Pomßen                                  ",143,615.29999999999995,null,628.29999999999995]
["Löbau","Rodewitz/Spree",280,810,7.2,null,null,"Porschdorf                              ",190,746.6,null,789.3]
["Löbau","Rosenbach",294,786,7.3,null,null,"Posseck",555,705.4,null," ---"]
["Löbau","Schirgiswalde, Stadt",320,800,7,null,null,"Possendorf                              ",296,670.1,null,769.6]
["Löbau","Schlegel",308,740,7.2,null,null,"Pulsnitz                                ",270,748.4,null,791]
["Löbau","Schmölln-Putzkau",331,882,7,null,null,"Quitzdorf am See-Sproitz (TS)           ",160,654.79999999999995,null,674.7]
["Löbau","Schönau-Berzdorf a. d. Eigen",231,723,7.5,null,null,"Rabenau                                 ",317,711.5,null,715.8]
["Löbau","Schönbach",400,900,6.8,null,null,"Radeberg                                ",276," ---",null,758.2]
["Löbau","Seifhennersdorf, Stadt",390,840,6.6,null,null,"Radebeul                                ",120," ---",null,600.5]
["Löbau","Sohland a. d. Spree",342,829,7.1,null,null,"Radeburg                                ",153,615.20000000000005,null,630.20000000000005]
["Löbau","Spitzkunnersdorf",340,820,6.8,null,null,"Radeburg (Speicher)                     ",146,657.4,null,649]
["Löbau","Steinigtwolmsdorf",405,950,6.7,null,null,"Radibor-Quoos                           ",155,568.79999999999995,null,600.9]
["Löbau","Strahwalde",345,800,7,null,null,"Rammenau                                ",301,745.8,null,769.9]
["Löbau","Uhyst",129,630,8.4,null,null,"Raschau                                 ",504," ---",null,906]
["Löbau","Walddorf",400,880,6.6,null,null,"Rechenberg-Bienenmühle-Holzhau          ",759.5,781.7,null,951.2]
["Löbau","Waltersdorf",390,850,6.4,null,null,"Reichenbach                             ",400," ---",null,741.1]
["Löbau","Weifa",450,925,6.7,null,null,"Reinersdorf                             ",140,596.70000000000005,null,598.29999999999995]
["Löbau","Weigsdorf-Köblitz",260,880,6.6,null,null,"Reinhardtsdorf                          ",232,796.1,null,844.8]
["Löbau","Weißenberg, Stadt",188,727,8.1999999999999993,null,null,"Reinsberg                               ",265,720.2,null,724.4]
["Löbau","Wilthen, Stadt",360,875,7,null,null,"Riesa (West)                            ",139,549.5,null,576]
["Löbau","Wittgendorf",290,740,7.4,null,null,"Rietschen                               ",145,630.29999999999995,null,661.2]
["Löbau","Zittau, Stadt",244,741,7.6,null,null,"Rittersgrün                             ",673,1024.4000000000001,null,1061.0999999999999]
[null,null,null,null,null,null,null,"Rochlitz                                ",185,678,null,704.1]
["Mittweida","Aitzendorf",270,760,7.3,null,null,"Röcknitz                                ",118,578.6,null,636]
["Mittweida","Altmittweida",300,780,7.6,null,null,"Rodewisch                               ",464,783.3,null,821.8]
["Mittweida","Arras",270,745,7.7,null,null,"Rosenbach-Bischdorf                     ",265,650.6,null,697.6]
["Mittweida","Auerswalde",306,766,7.4,null,null,"Rosenthal-Bielatal                      ",461.5,793.6,null,791.8]
["Mittweida","Breitenborn",267,720,7.8,null,null,"Rossau-Moosheim                         ",301," ---",null,752]
["Mittweida","Burgstädt, Stadt",274,765,7.7,null,null,"Roßwein                                 ",201,658.2,null,727.7]
["Mittweida","Chemnitz, Stadt",394,831,7.2,null,null,"Rötha (Talsperre)                       ",131,550.70000000000005,null,580.70000000000005]
["Mittweida","Chursdorf",260,755,7.9,null,null,"Sankt Egidien-Kuhschnappel              ",321," ---",null,760]
["Mittweida","Claußnitz",307,762,7.6,null,null,"Sankt Michaelis                         ",425,909.1,null,903.5]
["Mittweida","Dittersbach",320,800,7.4,null,null,"Sausedlitz                              ",88,544.29999999999995,null,549.20000000000005]
["Mittweida","Einsiedel",450,910,6.8,null,null,"Sayda                                   ",670,937.7,null,1012]
["Mittweida","Erlau",290,770,7.7,null,null,"Schildau                                ",120,597.5,null,589.29999999999995]
["Mittweida","Frankenau",277,779,7.6,null,null,"Schlema-Wildbach (Nst)                  ",408,833.4,null,886.4]
["Mittweida","Frankenberg, Stadt",347,790,7.3,null,null,"Schmiedeberg                            ",460,872.1,null,905.8]
["Mittweida","Geringswalde, Stadt",279,755,7.7,null,null,"Schnarrtanne-Vogelsgrün                 ",650," ---",null,1001.6]
["Mittweida","Grüna",360,820,6.8,null,null,"Schneeberg                              ",450,824.6,null,870]
["Mittweida","Grünlichtenberg",292,764,7.7,null,null,"Schöna, Sächsische Schweiz              ",280,721.4,null,773]
["Mittweida","Hainichen, Stadt",354,837,7.3,null,null,"Schönberg-Pfaffroda                     ",275," ---",null,691.7]
["Mittweida","Hartmannsdorf",340,760,7.5,null,null,"Schönbrunn/Sachsen                      ",400,803.5,null,834.5]
["Mittweida","Himmelhartha",200,720,7.9,null,null,"Schöneck-Kottenheide                    ",768,1069.7,null,1095]
["Mittweida","Holzhausen",287,742,7.7,null,null,"Schönfeld                               ",135,574.5,null,599.20000000000005]
["Mittweida","Klaffenbach",400,930,6.8,null,null,"Schönheide                              ",650," ---",null,1023.6]
["Mittweida","Kleinolbersdorf-Altenhain",450,870,6.9,null,null,"Schönwölkau-Brinnis                     ",101,564.70000000000005,null,562.9]
["Mittweida","Königsfeld",206,707,7.9,null,null,"Schwarzenberg                           ",418,871.3,null,900.7]
["Mittweida","Königshain-Wiederau",270,775,7.7,null,null,"Schwarzenberg-Bermsgrün                 ",563," ---",null,920.9]
["Mittweida","Kriebstein",273,800,7.8,null,null,"Schwepnitz                              ",142,639.5,null,672.8]
["Mittweida","Krumbach",290,780,7.7,null,null,"Sdier (Wasserwerk)                      ",150,617.4,null,641]
["Mittweida","Langensteinbach",234,704,7.8,null,null,"Sebnitz                                 ",335,854.5,null,902.2]
["Mittweida","Lauenhain-Tanneberg",295,800,7.6,null,null,"Skaska                                  ",145,603,null,635.79999999999995]
["Mittweida","Lichtenau",300,765,7.6,null,null,"Sohland/Spree                           ",290.5," ---",null,790]
["Mittweida","Lunzenau, Stadt",231,738,7.9,null,null,"Sollschwitz                             ",132,594.1,null,635.6]
["Mittweida","Milkau",256,753,7.7,null,null,"Sörnewitz-Reudnitz                      ",155,555.4,null,597.79999999999995]
["Mittweida","Mittelbach",365,820,6.8,null,null,"Sosa Talsperre                          ",650,1003.6,null,1031.7]
["Mittweida","Mittweida, Stadt",283,786,7.8,null,null,"Spittwitz                               ",215,657.4,null,738]
["Mittweida","Mohsdorf",275,770,7.6,null,null,"Steinbach                               ",179,605.29999999999995,null,628.1]
["Mittweida","Mühlau",320,770,7.7,null,null,"Stollberg/Erzg, (TS)                    ",430,884.7,null,877]
["Mittweida","Mühlbach",371,776,7.3,null,null,"Stollberg-Gablenz                       ",510.5," ---",null,859.7]
["Mittweida","Neukirchen/Erzgeb.",375,850,6.8,null,null,"Stolpen                                 ",260.5,705.4,null,731]
["Mittweida","Obergräfenhain",275,725,7.6,null,null,"Strauch                                 ",138," ---",null,625]
["Mittweida","Ottendorf",320,770,7.4,null,null,"Strehla                                 ",95,553.1,null,592.4]
["Mittweida","Penig, Stadt",249,745,7.9,null,null,"Stützengrün-Hundshübel                  ",604,1022.9,null,990.8]
["Mittweida","Reichenbach",280,760,7.7,null,null,"Tanneberg                               ",248,591.20000000000005,null,628.6]
["Mittweida","Rochlitz, Stadt",215,714,8.1,null,null,"Tannenberg                              ",532,945.6,null,997.2]
["Mittweida","Röhrsdorf",355,800,7.2,null,null,"Taubenheim-Seeligstadt                  ",273," ---",null,745.6]
["Mittweida","Rossau",289,786,7.6,null,null,"Taucha                                  ",127,629.1,null,643.29999999999995]
["Mittweida","Schlegel",300,820,7.6,null,null,"Tauscha-Würschnitz                      ",170,635.29999999999995,null,664.7]
["Mittweida","Schönborn-Dreiwerden-Seifers",319,800,7.5,null,null,"Tharandt-Grillenburg                    ",384,855.5,null,898]
["Mittweida","Seelitz",233,738,7.9,null,null,"Thoßfell                                ",425,721.8,null,734.3]
["Mittweida","Stein i. Chemnitztal",260,760,7.6,null,null,"Thronitz                                ",117,559.6,null,582.9]
["Mittweida","Striegistal",316,820,7.4,null,null,"Tiefenbach-Boehringen",null,715.2,null," ---"]
["Mittweida","Taura b. Burgstädt",306,770,7.5,null,null,"Tiefensee, Kreis Delitzsch              ",90,547.79999999999995,null,592.70000000000005]
["Mittweida","Tauscha",260,755,7.9,null,null,"Tirpersdorf                             ",492,744.1,null,760.7]
["Mittweida","Thierbach",275,742,7.9,null,null,"Tobertitz                               ",470,726.8,null,712.8]
["Mittweida","Tiefenbach",291,762,7.7,null,null,"Torgau                                  ",80,541.6,null,553.79999999999995]
["Mittweida","Wechselburg",248,745,7.9,null,null,"Trebendorf                              ",143,654.70000000000005,null,666.9]
["Mittweida","Wittgensdorf",320,780,7.2,null,null,"Trebsen                                 ",129,597.79999999999995,null,624.1]
["Mittweida","Zettlitz",240,725,7.8,null,null,"Treuen                                  ",465," ---",null,780]
[null,null,null,null,null,null,null,"Triebischtal-Munzig                     ",200," ---",null,710]
["Mockrehna","Arzberg",89,544,8.8000000000000007,null,null,"Trossin                                 ",105,595.5,null,626.4]
["Mockrehna","Audenhain",96,560,8.3000000000000007,null,null,"Uhyst                                   ",132,600.4,null,621.20000000000005]
["Mockrehna","Authausen",115,580,8.4,null,null,"Wahnsdorf bei Dresden                   ",246," ---",null,659.1]
["Mockrehna","Bad Düben, Stadt",90,558,8.6999999999999993,null,null,"Waldenburg                              ",240," ---",null,677.8]
["Mockrehna","Badrina",92,525,8.8000000000000007,null,null,"Waldhufen-Diehsa                        ",198,678.5,null,675.1]
["Mockrehna","Battaune",98,550,8.9,null,null,"Wechselburg-Meusen                      ",238," ---",null,734.8]
["Mockrehna","Beilrode",85,570,8.8000000000000007,null,null,"Wehrsdorf                               ",335,820.6,null,833.5]
["Mockrehna","Belgern, Stadt",114,548,8.5,null,null,"Weidenhain                              ",118,560.5,null,589.6]
["Mockrehna","Brinnis",101,505,8.8000000000000007,null,null,"Weischlitz-Heinersgrün                  ",517," ---",null,668.3]
["Mockrehna","Delitzsch, Stadt",93,512,8.8000000000000007,null,null,"Weißbach bei Königsbrück                ",180,686.5,null,709.2]
["Mockrehna","Döbernitz",99,500,8.8000000000000007,null,null,"Weißenberg                              ",188,598.79999999999995,null,623]
["Mockrehna","Doberschütz",106,555,8.4,null,null,"Weißig am Raschütz                      ",150,613.20000000000005,null,598]
["Mockrehna","Döbrichau",84,560,8.8000000000000007,null,null,"Weißkeißel                              ",125,636,null,659.2]
["Mockrehna","Dommitzsch, Stadt",110,550,8.5,null,null,"Weißwasser                              ",155," ---",null,674.8]
["Mockrehna","Dreiheide",103,557,8.4,null,null,"Weißwasser (Nord)                       ",135,627.29999999999995,null,657]
["Mockrehna","Eilenburg, Stadt",110,560,8.6,null,null,"Werda (TS Geigenbach)                   ",595,845,null,856.1]
["Mockrehna","Elsnig",85,550,8.6,null,null,"Werdau-Langenhessen                     ",295,661.4,null,656.9]
["Mockrehna","Glaucha",91,530,8.6,null,null,"Wildenfels-Härtensdorf                  ",355,761.1,null,795]
["Mockrehna","Glesien",120,500,8.8000000000000007,null,null,"Wilsdruff                               ",275," ---",null,728.4]
["Mockrehna","Großtreben-Zwethau",80,570,8.8000000000000007,null,null,"Wilsdruff-Mohorn                        ",285," ---",null,739]
["Mockrehna","Hohenprießnitz",105,550,8.6,null,null,"Wilthen                                 ",293," ---",null,811.9]
["Mockrehna","Hohenroda",108,500,8.8000000000000007,null,null,"Wuenschendorf-N. (Talsp.)",419,933.9,null," ---"]
["Mockrehna","Jesewitz",131,570,8.5,null,null,"Wurzen                                  ",127," ---",null,616]
["Mockrehna","Kletzen-Zschölkau",118,526,8.8000000000000007,null,null,"Zabeltitz-Stroga",110,583.20000000000005,null," ---"]
["Mockrehna","Kobershain",140,560,8.3000000000000007,null,null,"Zehren                                  ",108,594.5,null,627]
["Mockrehna","Kospa-Pressen",132,555,8.9,null,null,"Zinnwald-Georgenfeld                    ",876.6,976.7,null,995.3]
["Mockrehna","Kossa",117,569,8.5,null,null,"Zittau                                  ",235," ---",null,636]
["Mockrehna","Krippehna",104,525,8.8000000000000007,null,null,"Zschortau-Brodenaundorf                 ",106,535.1,null,556.79999999999995]
["Mockrehna","Krostitz",120,529,8.6999999999999993,null,null,"Zwenkau-Zitzschen                       ",125,543.29999999999995,null,571.9]
["Mockrehna","Lausa",165,580,8.6,null,null,"Zwickau-Planitz",347,724.2,null," ---"]
["Mockrehna","Laußig",94,537,8.9,null,null,"Zwönitz                                 ",497,964.4,null,953.1]
["Mockrehna","Lindenhain",103,500,8.8000000000000007,null,null,"Zwota                                   ",695,994.9,null,1026.3]
["Mockrehna","Löbnitz",85,522,8.6999999999999993]
["Mockrehna","Mockrehna",100,560,8.3000000000000007]
["Mockrehna","Mörtitz",99,553,8.9]
["Mockrehna","Naundorf",106,533,8.8000000000000007]
["Mockrehna","Neukyhna",97,496,8.8000000000000007]
["Mockrehna","Neußen",120,538,8.5]
["Mockrehna","Paschwitz",119,553,8.9]
["Mockrehna","Pflückuff",90,545,8.6]
["Mockrehna","Pressel",106,554,8.6]
["Mockrehna","Priester",130,495,8.8000000000000007]
["Mockrehna","Rackwitz",120,520,8.8000000000000007]
["Mockrehna","Radefeld",125,519,8.9]
["Mockrehna","Schenkenberg",93,514,8.8000000000000007]
["Mockrehna","Schildau, Gneisenaustadt, St",135,571,8.4]
["Mockrehna","Schnaditz",36,550,8.8000000000000007]
["Mockrehna","Schöna",108,560,8.3000000000000007]
["Mockrehna","Spröda",98,525,8.8000000000000007]
["Mockrehna","Sprotta",101,575,8.9]
["Mockrehna","Staritz",100,580,8.6]
["Mockrehna","Strelln",112,560,8.3000000000000007]
["Mockrehna","Taura",109,590,8.6]
["Mockrehna","Tiefensee",90,550,8.8000000000000007]
["Mockrehna","Torgau, Stadt",88,559,8.6]
["Mockrehna","Trossin",114,554,8.6]
["Mockrehna","Wiedemar",111,500,8.8000000000000007]
["Mockrehna","Wildenhain",98,560,8.3000000000000007]
["Mockrehna","Wildschütz",105,560,8.3000000000000007]
["Mockrehna","Wölkau",110,530,8.8000000000000007]
["Mockrehna","Wöllnau",97,553,8.9]
["Mockrehna","Wörblitz",79,546,8.6999999999999993]
["Mockrehna","Zinna",105,530,8.8000000000000007]
["Mockrehna","Zschepplin",110,550,8.6]
["Mockrehna","Zschortau",101,491,8.8000000000000007]
["Mockrehna","Zwochau",113,492,8.8000000000000007]
[]
["Niesky","Bad Muskau, Stadt",110,670,8.4]
["Niesky","Boxberg",128,670,8.4]
["Niesky","Deschka",182,650,8.1999999999999993]
["Niesky","Gablenz",136,670,8.4]
["Niesky","Gebelzig",185,700,8.1999999999999993]
["Niesky","Görlitz, Stadt",210,645,7.4]
["Niesky","Groß Düben",132,670,8.4]
["Niesky","Groß Krauscha",183,680,8.1999999999999993]
["Niesky","Groß-Radisch",248,700,8]
["Niesky","Hähnichen",154,696,8.1999999999999993]
["Niesky","Halbendorf",134,670,8.4]
["Niesky","Horka",168,698,8.1999999999999993]
["Niesky","Kaltwasser",182,680,8]
["Niesky","Klitten",134,656,8.4]
["Niesky","Kodersdorf",181,689,8]
["Niesky","Königshain",230,715,7.8]
["Niesky","Krauschwitz",130,670,8.4]
["Niesky","Kreba-Neudorf",141,670,8.4]
["Niesky","Kringelsdorf",131,670,8.4]
["Niesky","Kromlau",135,670,8.4]
["Niesky","Kunnerwitz",255,700,8]
["Niesky","Lodenau",154,700,8.1999999999999993]
["Niesky","Ludwigsdorf",180,700,8]
["Niesky","Markersdorf",271,720,7.8]
["Niesky","Mücka",149,687,8.4]
["Niesky","Mühlrose",124,670,8.4]
["Niesky","Mulkwitz",124,670,8.4]
["Niesky","Nieder-Neundorf",170,680,8.1999999999999993]
["Niesky","Niesky, Stadt",164,677,8.1999999999999993]
["Niesky","Petershain",155,680,8.1999999999999993]
["Niesky","Pfaffendorf",257,700,8]
["Niesky","Quitzdorf am See",165,686,8.3000000000000007]
["Niesky","Reichenbach/O.L., Stadt",232,707,7.9]
["Niesky","Reichwalde",135,670,8.4]
["Niesky","Rietschen",143,670,8.4]
["Niesky","Rohne",122,670,8.4]
["Niesky","Rothenburg/O.L., Stadt",158,700,8.1999999999999993]
["Niesky","Schleife",129,670,8.4]
["Niesky","Schöpstal",208,700,8]
["Niesky","Sohland a. Rotstein",260,760,7.8]
["Niesky","Spree",155,700,8.1999999999999993]
["Niesky","Trebendorf",140,670,8.4]
["Niesky","Uhsmannsdorf",170,700,8.1999999999999993]
["Niesky","Vierkirchen",203,684,8.1]
["Niesky","Waldhufen",175,688,8.1999999999999993]
["Niesky","Weigersdorf",174,700,8.3000000000000007]
["Niesky","Weißkeißel",126,670,8.4]
["Niesky","Weißwasser, Stadt",133,670,8.4]
["Niesky","Zodel",189,680,8.1999999999999993]
[]
["Plauen","Adorf, Stadt",490,814,6.2]
["Plauen","Arnoldsgrün",545,810,5.9]
["Plauen","Auerbach/Vogtl., Stadt",517,889,5.8]
["Plauen","Bad Brambach",585,796,5.9]
["Plauen","Bad Elster, Stadt",500,797,6.1]
["Plauen","Beerheide",685,950,5.2]
["Plauen","Bergen",475,780,6.2]
["Plauen","Bösenbrunn",488,708,6.4]
["Plauen","Brockau",425,690,7]
["Plauen","Burgstein",514,686,6.3]
["Plauen","Cunsdorf",400,644,7]
["Plauen","Dröda",500,730,6.4]
["Plauen","Eich/Sa.",495,830,6.4]
["Plauen","Eichigt",544,784,6]
["Plauen","Ellefeld",590,880,6.1]
["Plauen","Elsterberg, Stadt",362,660,7.2]
["Plauen","Erlbach",525,852,6.2]
["Plauen","Falkenstein/Vogtl., Stadt",570,857,6]
["Plauen","Großfriesen",430,700,6.8]
["Plauen","Grünbach, Höhenluftkurort",696,976,5.2]
["Plauen","Gunzen",580,840,5.6]
["Plauen","Hammerbrücke",700,999,5.3]
["Plauen","Hartmannsgrün",445,751,6.6]
["Plauen","Heinsdorfergrund",395,796,6.8]
["Plauen","Jößnitz",406,668,7]
["Plauen","Kauschwitz",420,676,7]
["Plauen","Klingenthal/Sa., Stadt",627,972,5.0999999999999996]
["Plauen","Kloschwitz",380,660,7.1]
["Plauen","Kürbitz",365,660,7.1]
["Plauen","Landwüst",615,770,6]
["Plauen","Lengenfeld, Stadt",408,813,6.8]
["Plauen","Leubetha",495,810,6.4]
["Plauen","Leubnitz",435,660,6.7]
["Plauen","Limbach",415,722,6.9]
["Plauen","Markneukirchen, Stadt",549,829,6.1]
["Plauen","Mechelgrün",440,730,6.8]
["Plauen","Mehltheuer",471,667,6.6]
["Plauen","Morgenröthe-Rautenkranz",680,999,5]
["Plauen","Mühlental",500,797,6.1]
["Plauen","Mühltroff, Stadt",501,673,6.9]
["Plauen","Mylau, Stadt",350,680,6.9]
["Plauen","Netzschkau, Stadt",389,706,6.9]
["Plauen","Neuensalz",415,718,6.9]
["Plauen","Neumark",372,786,7]
["Plauen","Neundorf",402,666,6.8]
["Plauen","Neustadt/Vogtl.",625,859,5.6]
["Plauen","Oberlauterbach",460,802,6.1]
["Plauen","Obermylau",375,700,6.8]
["Plauen","Oelsnitz, Stadt",426,687,6.6]
["Plauen","Pausa/Vogtl., Stadt",462,637,6.9]
["Plauen","Plauen, Stadt",365,677,6.9]
["Plauen","Pöhl",396,693,7]
["Plauen","Rebesgrün",515,837,6.4]
["Plauen","Reichenbach/Vogtl., Stadt",371,746,6.8]
["Plauen","Reuth",541,683,6.1]
["Plauen","Rodau",443,670,6.5]
["Plauen","Rodewisch, Stadt",484,872,6.3]
["Plauen","Rößnitz",395,670,6.6]
["Plauen","Rotschau",400,730,6.8]
["Plauen","Schilbach",560,840,6]
["Plauen","Schneckengrün",460,670,6.7]
["Plauen","Schneidenbach",360,750,6.8]
["Plauen","Schönberg",510,660,6.2]
["Plauen","Schönbrunn",415,790,6.8]
["Plauen","Schöneck/Vogtl., Stadt",720,914,5.3]
["Plauen","Steinberg",562,932,6]
["Plauen","Straßberg",365,670,7.1]
["Plauen","Syrau",443,661,6.8]
["Plauen","Tannenbergsthal/Vogtl.",655,999,5]
["Plauen","Theuma",480,730,6.6]
["Plauen","Tirpersdorf",492,740,6.3]
["Plauen","Treuen, Stadt",436,757,6.6]
["Plauen","Trieb/Vogtl.",435,807,6.3]
["Plauen","Triebel/Vogtl.",523,721,6.1]
["Plauen","Waldkirchen",410,810,6.8]
["Plauen","Weischlitz",411,674,6.7]
["Plauen","Werda",620,828,5.6]
["Plauen","Wernitzgrün",610,865,6]
["Plauen","Zwota",603,938,5.3]
[]
["Rötha","Altmörbitz",210,640,8]
["Rötha","Audigast",126,580,8.6]
["Rötha","Auligk",145,577,8.6]
["Rötha","Baalsdorf",135,640,8.4]
["Rötha","Benndorf",165,610,8.1999999999999993]
["Rötha","Berndorf",141,581,8.4]
["Rötha","Bienitz",118,542,8.6999999999999993]
["Rötha","Böhlen, Stadt",124,585,8.8000000000000007]
["Rötha","Böhlitz-Ehrenberg",105,535,8.8000000000000007]
["Rötha","Borna, Stadt",142,627,8.6]
["Rötha","Borsdorf",125,660,8.6999999999999993]
["Rötha","Deutzen",135,590,8.5]
["Rötha","Dolsenhain",200,640,8]
["Rötha","Dreiskau-Muckern",128,612,8.5]
["Rötha","Elstertrebnitz",133,580,8.6]
["Rötha","Engelsdorf",129,639,8.8000000000000007]
["Rötha","Eschefeld",180,620,8.1999999999999993]
["Rötha","Espenhain",150,625,8.5]
["Rötha","Eulatal",191,649,8]
["Rötha","Frankenheim",120,560,8.8000000000000007]
["Rötha","Frauendorf",190,640,8.1999999999999993]
["Rötha","Frohburg, Stadt",176,637,8.1]
["Rötha","Geithain, Stadt",229,681,7.8]
["Rötha","Gnandstein",200,630,8]
["Rötha","Greifenhain",190,640,8.1999999999999993]
["Rötha","Groitzsch, Stadt",130,588,8.6999999999999993]
["Rötha","Großdeuben",125,617,8.6999999999999993]
["Rötha","Großlehna",125,570,9]
["Rötha","Großpösna",142,648,8.4]
["Rötha","Großstolpen",140,585,8.6]
["Rötha","Hainichen",154,580,8.3000000000000007]
["Rötha","Heuersdorf",150,590,8.4]
["Rötha","Holzhausen",140,640,8.4]
["Rötha","Jahnshain",250,680,7.8]
["Rötha","Kitzen",127,580,8.6999999999999993]
["Rötha","Kitzscher, Stadt",154,620,8.6]
["Rötha","Kohren-Sahlis, Stadt",220,630,7.9]
["Rötha","Kulkwitz",127,580,8.6]
["Rötha","Lausen",122,590,8.9]
["Rötha","Leipzig, Stadt",122,606,8.8000000000000007]
["Rötha","Liebertwolkwitz",145,640,8.4]
["Rötha","Lindenthal",125,545,8.8000000000000007]
["Rötha","Lippendorf-Kieritzsch",138,590,8.6999999999999993]
["Rötha","Lobstädt",131,615,8.5]
["Rötha","Lützschema-Stahmeln",130,540,8.6]
["Rötha","Markkleeberg, Stadt",136,624,8.6]
["Rötha","Markranstädt, Stadt",122,583,8.8000000000000007]
["Rötha","Miltitz",120,580,9]
["Rötha","Mölbis",141,592,8.8000000000000007]
["Rötha","Mölkau",133,640,8.8000000000000007]
["Rötha","Narsdorf",258,674,7.5]
["Rötha","Nauenhain",228,696,7.8]
["Rötha","Nenkersdorf",175,620,8.1999999999999993]
["Rötha","Neukieritzsch",142,600,8.5]
["Rötha","Oelzschau",136,624,8.4]
["Rötha","Ossa",255,680,7.6]
["Rötha","Panitzsch",125,625,8.5]
["Rötha","Pegau, Stadt",126,567,8.6999999999999993]
["Rötha","Plaußig",125,570,8.8000000000000007]
["Rötha","Podelwitz",125,560,8.8000000000000007]
["Rötha","Pötzschau",133,625,8.5]
["Rötha","Ramsdorf",147,580,8.4]
["Rötha","Rathendorf",259,690,7.6]
["Rötha","Regis-Breitingen, Stadt",139,580,8.4]
["Rötha","Roda",210,640,8]
["Rötha","Rötha, Stadt",123,600,8.6]
["Rötha","Rüssen-Kleinstorkwitz",137,587,8.6]
["Rötha","Schkeuditz, Stadt",154,500,8.5]
["Rötha","Seehausen",133,560,8.8000000000000007]
["Rötha","Störmthal",152,653,8.5]
["Rötha","Taucha, Stadt",134,602,8.5]
["Rötha","Thräna",152,588,8.4]
["Rötha","Wiederitzsch",122,580,8.8000000000000007]
["Rötha","Wyhratal",144,629,8.1999999999999993]
["Rötha","Zwenkau, Stadt",126,582,8.6999999999999993]
[]
["Pirna","Altenberg, Stadt",752,994,5]
["Pirna","Bad Gottleuba, Kurort, Stadt",415,840,6.5]
["Pirna","Bad Schandau, Stadt",159,764,7.9]
["Pirna","Bahratal",400,690,7.6]
["Pirna","Bahretal",331,778,7.2]
["Pirna","Bannewitz",250,695,8]
["Pirna","Bärenburg, Kurort",695,990,5.2]
["Pirna","Bärenfels, Kurort",680,970,5.4]
["Pirna","Bärenstein, Stadt",502,876,6.1]
["Pirna","Berggießhübel, Kurort, Stadt",335,810,7]
["Pirna","Birkwitz-Pratzschwitz",120,680,8.4]
["Pirna","Börnersdorf-Breitenau",534,836,6.2]
["Pirna","Colmnitz",450,850,6.6]
["Pirna","Cotta",280,767,7.4]
["Pirna","Cunnersdorf",390,780,6.8]
["Pirna","Dippoldiswalde, Stadt",381,841,6.8]
["Pirna","Dittersdorf",513,831,6.3]
["Pirna","Dohma",200,734,7.5]
["Pirna","Dohna, Stadt",213,715,7.9]
["Pirna","Dorfhain",350,855,6.8]
["Pirna","Dürrröhrsdorf-Dittersbach",255,761,7.8]
["Pirna","Falkenhain",620,930,5.6]
["Pirna","Frauendorf",476,872,6.3]
["Pirna","Freital, Stadt",241,728,7.6]
["Pirna","Geising, Stadt",636,974,5.6]
["Pirna","Glashütte, Stadt",506,864,6.3]
["Pirna","Gohrisch, Kurort",273,607,6]
["Pirna","Goppeln",240,675,8.3000000000000007]
["Pirna","Graupa",149,692,8.1999999999999993]
["Pirna","Grumbach",280,760,7.4]
["Pirna","Hartmannsdorf-Reichenau",569,937,5.6]
["Pirna","Hausdorf",340,770,7.2]
["Pirna","Heidenau, Stadt",120,695,8.1]
["Pirna","Hermsdorf/Erzgeb.",727,999,5]
["Pirna","Hinterhermsdorf",420,870,6.4]
["Pirna","Hirschbach",340,800,6.9]
["Pirna","Höckendorf",401,849,6.7]
["Pirna","Hohnstein, Stadt",336,819,7.3]
["Pirna","Hohwald",359,936,6.6]
["Pirna","Kesselsdorf",311,757,7.6]
["Pirna","Kipsdorf, Kurort",560,940,6]
["Pirna","Kirnitzschtal",313,814,7.1]
["Pirna","Klingenberg",390,850,6.5]
["Pirna","Königstein/Sächs.Schw., Stad",219,707,7.9]
["Pirna","Kreischa",221,740,7.8]
["Pirna","Krippen",140,750,7.9]
["Pirna","Kurort Hartha",346,810,7.4]
["Pirna","Langenhennersdorf",300,815,7]
["Pirna","Leupoldishain",290,750,7.4]
["Pirna","Liebstadt, Stadt",407,800,6.6]
["Pirna","Lohmen",225,700,8]
["Pirna","Malter",365,838,6.9]
["Pirna","Meusegast",250,712,7.9]
["Pirna","Mohorn",331,776,7.4]
["Pirna","Müglitztal",298,743,7.3]
["Pirna","Neustadt i. Sa., Stadt",353,911,6.8]
["Pirna","Obercarsdorf",570,910,6]
["Pirna","Oelsen",580,880,6]
["Pirna","Paulsdorf",365,838,6.9]
["Pirna","Pesterwitz",270,690,7.9]
["Pirna","Pirna, Stadt",174,719,8]
["Pirna","Pohrsdorf",350,810,7.5]
["Pirna","Porschdorf",193,736,8]
["Pirna","Possendorf",296,741,7.7]
["Pirna","Pretzschendorf",494,847,6.3]
["Pirna","Rabenau, Stadt",318,811,6.8]
["Pirna","Rathen, Kurort",140,695,7.9]
["Pirna","Rathmannsdorf",225,750,8]
["Pirna","Reichstädt",450,880,6.4]
["Pirna","Reinhardtsdorf-Schöna",273,761,7.2]
["Pirna","Reinhardtsgrimma",340,770,7]
["Pirna","Röhrsdorf",224,715,7.9]
["Pirna","Rosenthal-Bielatal",392,836,6.6]
["Pirna","Schellerhau",740,999,5]
["Pirna","Schlottwitz",280,760,7.4]
["Pirna","Schmiedeberg",473,898,6.2]
["Pirna","Schönfeld",660,980,5.2]
["Pirna","Sebnitz, Stadt",290,821,7]
["Pirna","Seifersdorf",370,840,7]
["Pirna","Stadt Wehlen, Stadt",231,699,8]
["Pirna","Stolpen, Stadt",289,849,7.5]
["Pirna","Struppen",229,705,7.8]
["Pirna","Tharandt, Stadt",305,773,7.5]
["Pirna","Wilschdorf",270,800,7.8]
[]
["Wurzen","Altenhain",150,630,8.4]
["Wurzen","Bad Lausick, Stadt",186,646,8.1]
["Wurzen","Belgershain",152,652,8.4]
["Wurzen","Bennewitz",124,629,8.4]
["Wurzen","Beucha",126,669,8.6]
["Wurzen","Brandis, Stadt",143,697,8.4]
["Wurzen","Colditz, Stadt",191,683,8.1999999999999993]
["Wurzen","Dornreichenbach",149,600,8.4]
["Wurzen","Erlbach b. Rochlitz",250,705,7.9]
["Wurzen","Falkenhain",144,600,8.4]
["Wurzen","Fuchshain",145,650,8.5]
["Wurzen","Grimma, Stadt",166,646,8.3000000000000007]
["Wurzen","Großbardau",165,656,8.1999999999999993]
["Wurzen","Großbothen",162,669,8.1999999999999993]
["Wurzen","Hausdorf b. Rochlitz",220,698,7.9]
["Wurzen","Hohburg",134,606,8.4]
["Wurzen","Kühnitzsch",147,643,8.6]
["Wurzen","Kühren-Burkartshain",140,620,8.5]
["Wurzen","Machern",132,627,8.4]
["Wurzen","Meltewitz",150,600,8.4]
["Wurzen","Mutzschen, Stadt",197,674,8.1999999999999993]
["Wurzen","Naunhof",133,667,8.5]
["Wurzen","Nerchau, Stadt",160,657,8.3000000000000007]
["Wurzen","Otterwisch",161,656,8.4]
["Wurzen","Parthenstein",148,651,8.4]
["Wurzen","Röcknitz-Böhlitz",128,600,8.5]
["Wurzen","Steinbach",153,609,8.6]
["Wurzen","Tanndorf",142,690,8]
["Wurzen","Thallwitz",119,600,8.5]
["Wurzen","Thammenhain",138,600,8.4]
["Wurzen","Threna",160,650,8.4]
["Wurzen","Thümmlitzwalde",195,667,8.1999999999999993]
["Wurzen","Trebsen/Mulde, Stadt",137,642,8.3000000000000007]
["Wurzen","Wurzen, Stadt",126,611,8.5]
["Wurzen","Zschadraß",213,684,8.1]
[]
["Zug","Augustusburg, Stadt",430,820,7]
["Zug","Bobritzsch",439,849,6.5]
["Zug","Brand-Erbisdorf, Stadt",467,860,6.4]
["Zug","Braunsdorf",280,760,7.6]
["Zug","Bräunsdorf-Langhennersdorf",356,842,7.2]
["Zug","Breitenau",400,800,6.8]
["Zug","Dorfchemnitz b. Sayda",592,890,5.9]
["Zug","Eppendorf",475,900,6.2]
["Zug","Erdmannsdorf",370,790,7.2]
["Zug","Falkenau",300,780,7.4]
["Zug","Flöha, Stadt",334,770,7.4]
["Zug","Frankenstein",421,855,6.6]
["Zug","Frauenstein, Stadt",591,920,5.7]
["Zug","Freiberg, Stadt",406,861,6.9]
["Zug","Gahlenz",455,890,6.4]
["Zug","Großhartmannsdorf",553,908,6]
["Zug","Großschirma",351,807,7.2]
["Zug","Großwaltersdorf",520,935,6.1]
["Zug","Grünberg",400,800,7]
["Zug","Halsbrücke",361,825,7.2]
["Zug","Hennersdorf",340,800,7.2]
["Zug","Hilbersdorf",400,825,7]
["Zug","Kleinhartmannsdorf",520,900,6.2]
["Zug","Langenau",517,885,6]
["Zug","Leubsdorf",423,853,6.9]
["Zug","Lichtenberg/Erzgeb.",483,878,6.3]
["Zug","Lichtenwalde",290,770,7.6]
["Zug","Mulda/Sa.",533,885,6]
["Zug","Neuhausen/Erzgeb.",623,976,5.3]
["Zug","Niederschöna",369,825,7]
["Zug","Niederwiesa",330,770,7.4]
["Zug","Oberschöna",418,822,7]
["Zug","Oederan,  Stadt",450,843,6.6]
["Zug","Rechenberg-Bienenmühle",632,960,5.3]
["Zug","Reichenbach b. Siebenlehn",329,825,7.3]
["Zug","Reinsberg",296,759,7.2]
["Zug","Sayda, Stadt",637,928,5.6]
["Zug","Siebenlehn, Stadt",329,776,7.5]
["Zug","Weißenborn/Erzgeb.",459,872,6.7]
[]
["Zwickau","Bernsdorf",328,804,7]
["Zwickau","Bräunsdorf",315,770,7.4]
["Zwickau","Cainsdorf",390,760,7.2]
["Zwickau","Callenberg",347,770,7.2]
["Zwickau","Chursbachtal",343,790,7.2]
["Zwickau","Crimmitschau, Stadt",283,738,7.5]
["Zwickau","Crinitzberg",477,893,6.3]
["Zwickau","Crossen",279,750,7.5]
["Zwickau","Culitzsch",360,780,7]
["Zwickau","Cunersdorf",315,795,7]
["Zwickau","Dänkritz",315,770,7.2]
["Zwickau","Dennheritz",275,747,7.5]
["Zwickau","Dürrenuhlsdorf",265,746,7.7]
["Zwickau","Ebersbrunn",420,800,7]
["Zwickau","Fraureuth",305,770,7.6]
["Zwickau","Friedrichsgrün",360,810,7]
["Zwickau","Gersdorf",320,840,6.9]
["Zwickau","Glauchau, Stadt",281,746,7.4]
["Zwickau","Härtensdorf",360,830,6.9]
["Zwickau","Hartenstein, Stadt",395,861,6.7]
["Zwickau","Hartmannsdorf b. Kirchberg",415,902,6.4]
["Zwickau","Heinrichsort",425,830,6.6]
["Zwickau","Hirschfeld",395,820,7]
["Zwickau","Hohenstein-Ernstthalthal, St",410,840,6.8]
["Zwickau","Kändler",415,850,6.8]
["Zwickau","Kirchberg, Stadt",394,835,6.8]
["Zwickau","Königswalde",330,760,7.2]
["Zwickau","Kuhschnappel",320,780,6.9]
["Zwickau","Langenbach",365,850,6.9]
["Zwickau","Langenbernsdorf",301,747,7.4]
["Zwickau","Langenhessen",280,735,7.6]
["Zwickau","Lauenhain",275,760,7.4]
["Zwickau","Lauterbach",290,760,7.5]
["Zwickau","Leubnitz",300,760,7.4]
["Zwickau","Leutersbach",419,862,6.7]
["Zwickau","Lichtenstein/Sa., Stadt",351,807,7.1]
["Zwickau","Lichtentanne",340,780,7.3]
["Zwickau","Limbach-Oberfrohna, Stadt",353,806,7.2]
["Zwickau","Lobsdorf",340,770,7.2]
["Zwickau","Meerane, Stadt",275,723,7.6]
["Zwickau","Mosel",280,750,7.4]
["Zwickau","Mülsen St. Jacob",320,800,7]
["Zwickau","Mülsen St. Micheln",300,800,7.1]
["Zwickau","Mülsen St. Niclas",330,805,6.9]
["Zwickau","Neukirchen/Pleiße",245,744,7.6]
["Zwickau","Niedercrinitz",340,800,7.1]
["Zwickau","Niederfrohna",313,780,7.4]
["Zwickau","Niedermülsen",280,760,7.6]
["Zwickau","Oberlungwitz, Stadt",350,860,6.9]
["Zwickau","Oberrothenbach",270,750,7.3]
["Zwickau","Oberwiera",265,726,7.7]
["Zwickau","Ortmannsdorf",400,830,6.8]
["Zwickau","Pleißa",415,860,6.9]
["Zwickau","Reinsdorf",320,790,7]
["Zwickau","Remse",268,738,7.5]
["Zwickau","Rottmannsdorf",375,785,7.1]
["Zwickau","Ruppertsgrün",325,777,7.2]
["Zwickau","Saupersdorf",385,860,6.6]
["Zwickau","Schlunzig",245,750,7.6]
["Zwickau","Schönberg",274,699,7.5]
["Zwickau","Schönfels",370,780,7.1]
["Zwickau","Silberstraße",300,780,7.1]
["Zwickau","St.Egidien",300,780,7.2]
["Zwickau","Stangendorf",290,780,7.3]
["Zwickau","Stangengrün",460,850,6.4]
["Zwickau","Steinpleis",305,780,7.3]
["Zwickau","Stenn",380,780,7.2]
["Zwickau","Thurm",275,785,7.3]
["Zwickau","Vielau",340,780,7]
["Zwickau","Waldenburg, Stadt",280,749,7.6]
["Zwickau","Weißbach",365,847,6.8]
["Zwickau","Werdau, Stadt",320,760,7.4]
["Zwickau","Wiesenburg",329,795,7.1]
["Zwickau","Wildenfels, Stadt",330,820,7]
["Zwickau","Wilkau-Haßlau, Stadt",300,770,7.2]
["Zwickau","Wolfersgrün",380,840,7]
["Zwickau","Wolkenburg-Kaufungen",269,749,7.7]
["Zwickau","Wulm",250,750,7.6]
["Zwickau","Wüstenbrand",420,910,6.6]
["Zwickau","Zschocken",397,840,6.8]
["Zwickau","Zwickau, Stadt",271,751,7.6]
[]
["Zwönitz","Adorf/Erzgeb.",380,930,6.5]
["Zwönitz","Affalter",539,927,6.2]
["Zwönitz","Albernau",560,980,6]
["Zwönitz","Amtsberg",459,875,6.6]
["Zwönitz","Annaberg-Buchholz, Stadt",669,890,5.9]
["Zwönitz","Ansprung",623,964,5.6]
["Zwönitz","Antonsthal",520,999,5.8]
["Zwönitz","Arnsfeld",610,860,5.8]
["Zwönitz","Aue, Stadt",434,904,6.9]
["Zwönitz","Auerbach",560,960,5.7]
["Zwönitz","Bärenstein",730,999,5]
["Zwönitz","Beierfeld",550,910,6.2]
["Zwönitz","Bermsgrün",600,999,5.8]
["Zwönitz","Bernsbach",600,920,6.2]
["Zwönitz","Beutha",496,894,6.2]
["Zwönitz","Bockau",570,999,6]
["Zwönitz","Börnichen/Erzgeb.",490,965,6.6]
["Zwönitz","Borstendorf",430,930,6.6]
["Zwönitz","Breitenbrunn/Erzgeb.",678,998,5]
["Zwönitz","Brünlos",510,950,6]
["Zwönitz","Burkhardtsdorf",470,940,6.4]
["Zwönitz","Burkhardtsgrün",640,999,5.6]
["Zwönitz","Carlsfeld",850,999,4.5999999999999996]
["Zwönitz","Cranzahl",635,999,6]
["Zwönitz","Crottendorf",695,999,5]
["Zwönitz","Cunersdorf",625,944,5.5]
["Zwönitz","Deutscheinsiedel",420,990,4.8]
["Zwönitz","Deutschneudorf",650,950,5]
["Zwönitz","Dorfchemnitz",485,950,6.1]
["Zwönitz","Dörfel",595,870,6.2]
["Zwönitz","Dörnthal",609,900,5.8]
["Zwönitz","Drebach",520,880,6.4]
["Zwönitz","Ehrenfriedersdorf, Stadt",580,930,5.6]
["Zwönitz","Eibenstock, Stadt",629,976,5.4]
["Zwönitz","Elterlein, Stadt",620,975,5.5]
["Zwönitz","Erla",614,978,5.6]
["Zwönitz","Erlabrunn",660,999,5.2]
["Zwönitz","Erlbach-Kirchberg",335,854,6.8]
["Zwönitz","Falkenbach",500,860,6.4]
["Zwönitz","Frohnau",540,870,6]
["Zwönitz","Gehringswalde",495,910,6.4]
["Zwönitz","Gelenau/Erzgeb.",460,900,6.1]
["Zwönitz","Geyer, Stadt",620,940,5.6]
["Zwönitz","Geyersdorf",580,875,6.4]
["Zwönitz","Gornau/Erzgeb.",417,873,7]
["Zwönitz","Gornsdorf",475,950,6]
["Zwönitz","Grießbach",410,875,7]
["Zwönitz","Großolbersdorf",483,915,6.5]
["Zwönitz","Großrückerswalde",586,901,5.6]
["Zwönitz","Grumbach",770,900,4.7]
["Zwönitz","Grünhain, Stadt",630,980,5.6]
["Zwönitz","Grünhainichen",450,930,6.8]
["Zwönitz","Grünstädtel",540,940,6.2]
["Zwönitz","Hallbach",550,890,5.8]
["Zwönitz","Hammerunterwiesenthal",850,999,4.3]
["Zwönitz","Heidersdorf",575,940,5.6]
["Zwönitz","Hermannsdorf",615,890,6.2]
["Zwönitz","Herold",470,915,6.1]
["Zwönitz","Hilmersdorf",565,930,6]
["Zwönitz","Hirtstein",758,996,4.3]
["Zwönitz","Hohndorf",370,840,6.8]
["Zwönitz","Hopfgarten",420,860,6.8]
["Zwönitz","Hormersdorf",539,970,5.8]
["Zwönitz","Hundshübel",600,999,5.6]
["Zwönitz","Jahnsbach",600,980,5.6]
["Zwönitz","Jahnsdorf",420,920,6.4]
["Zwönitz","Johanngeorgenstadt, Stadt",705,999,4.5999999999999996]
["Zwönitz","Jöhstadt, Stadt",704,909,5]
["Zwönitz","Kemtau",500,940,6.6]
["Zwönitz","Königswalde",550,950,5.8]
["Zwönitz","Krumhermersdorf",520,950,6.4]
["Zwönitz","Lauter/Sa., Stadt",470,890,6.8]
["Zwönitz","Lauterbach",630,970,5.6]
["Zwönitz","Lengefeld, Stadt",500,980,6.4]
["Zwönitz","Leukersdorf/Erzgeb.",406,864,6.7]
["Zwönitz","Lichtenau",540,950,6]
["Zwönitz","Lindenau",530,940,6.4]
["Zwönitz","Lippersdorf",505,950,6]
["Zwönitz","Lößnitz, Stadt",459,906,6.7]
["Zwönitz","Lugau/Erzgeb., Stadt",400,860,6.6]
["Zwönitz","Marienberg, Stadt",611,992,5.8]
["Zwönitz","Markersbach",580,950,5.6]
["Zwönitz","Meinersdorf",440,950,6]
["Zwönitz","Mildenau",615,880,6]
["Zwönitz","Neudorf",710,999,4.7]
["Zwönitz","Neundorf",540,875,6.2]
["Zwönitz","Neuwürschnitz",420,890,6.4]
["Zwönitz","Niederdorf",400,900,6.6]
["Zwönitz","Niederlauterstein",550,975,6]
["Zwönitz","Niederwürschnitz",395,890,6.6]
["Zwönitz","Oberwiesenthal, Kurort, Stad",920,999,4]
["Zwönitz","Oelsnitz/Erzgeb., Stadt",375,850,6.6]
["Zwönitz","Olbernhau, Stadt",478,950,5.6]
["Zwönitz","Pfaffroda b. Sayda",544,905,5.8]
["Zwönitz","Pobershau",591,979,5.7]
["Zwönitz","Pockau/Flöhatal",451,936,6.4]
["Zwönitz","Pöhla",580,980,5.8]
["Zwönitz","Raschau",480,955,6]
["Zwönitz","Reifland",480,970,6.4]
["Zwönitz","Rittersgrün",652,980,5.2]
["Zwönitz","Scharfenstein",380,870,7]
["Zwönitz","Scheibenberg, Stadt",646,990,5.5]
["Zwönitz","Schlema",485,850,7]
["Zwönitz","Schlettau, Stadt",585,880,6]
["Zwönitz","Schneeberg, Stadt",529,939,6.4]
["Zwönitz","Schönbrunn",500,860,6.4]
["Zwönitz","Schönfeld",555,870,6.2]
["Zwönitz","Schönheide",637,999,5.5]
["Zwönitz","Schwarzbach",530,980,5.7]
["Zwönitz","Schwarzenberg/Erzgeb., Stadt",495,921,6.4]
["Zwönitz","Sehma",605,980,5.7]
["Zwönitz","Seiffen/Erzgeb., Kurort",660,970,4.8]
["Zwönitz","Sosa",650,999,5.2]
["Zwönitz","Steinbach",595,918,5.3]
["Zwönitz","Stollberg/Erzgeb., Stadt",457,918,6.3]
["Zwönitz","Streckewalde",480,860,6.6]
["Zwönitz","Stützengrün",585,999,5.6]
["Zwönitz","Tannenberg",515,930,6]
["Zwönitz","Thalheim/Erzgeb., Stadt",450,950,6.1]
["Zwönitz","Thum, Stadt",540,940,5.8]
["Zwönitz","Ursprung",385,800,6.7]
["Zwönitz","Venusberg",465,900,6.8]
["Zwönitz","Waldkirchen/Erzgeb.",460,900,6.6]
["Zwönitz","Walthersdorf",605,920,5.5]
["Zwönitz","Waschleithe",560,920,6]
["Zwönitz","Wiesa",495,870,6.5]
["Zwönitz","Wiesenbad, Thermalbad",460,875,6.2]
["Zwönitz","Wolkenstein, Stadt",465,870,6.5]
["Zwönitz","Wünschendorf",490,970,6.8]
["Zwönitz","Zöblitz, Stadt",600,970,5.7]
["Zwönitz","Zschopau, Stadt",390,900,7.2]
["Zwönitz","Zschorlau",540,960,6.4]

{"sheet":"Ergebnis","index":9,"n_rows":29,"n_cols":19,"rows_kept":29,"cut":false,"hidden":true,"merged":[[27,10,27,18]]}
[null,"Berechnungsschema / Ergebnisbeleg – Ermittlung Lagerkapazität"]
[null,null,"Einheit","Wert",null,"Betrieb:"]
[null,null,null,null,null,null,"Mustermann"]
[1,"anzurechnender Jahresniederschlag (Durchschn. langjähriges Niederschlagsmittel abzüglich 30 % Verdunstung)  ","m³/m² * Jahr",{"$f":"0.7*Betrieb!$F$4/1000","v":0.42},null,"Unternehmensnummer:",null,{"$f":"Deckblatt!E25","v":141234567890},{"$f":"Deckblatt!F25","v":0},{"$f":"Deckblatt!G25","v":0},{"$f":"Deckblatt!H25","v":0},{"$f":"Deckblatt!I25","v":0},{"$f":"Deckblatt!J25","v":0},{"$f":"Deckblatt!K25","v":0},{"$f":"Deckblatt!L25","v":0},{"$f":"Deckblatt!M25","v":0},{"$f":"Deckblatt!N25","v":0},{"$f":"Deckblatt!O25","v":0},{"$f":"Deckblatt!P25","v":0}]
[2,"Lagerkapazitätsberechnung für Festmist und feste Gärreste","--"]
[3,"Lagerraum im Stall (Tiefstreu)","m³",{"$f":"Betrieb!$M$24","v":0},null,"Die Berechnung erfolgte auf der Grundlage "]
[4," + Lagerraum Festmistlager","m³",{"$f":"Betrieb!$T$24","v":0},null,"der Angaben/Daten vom:"]
[5," = Summe verfügbarer Lagerraum","m³",{"$f":"D7+D6","v":0}]
[6,"Summe Anfall Festmist und feste Gärreste pro Tag (Anfall Tabelle 1  / 30)","m³/Tag",{"$f":"Betrieb!$J$8/((Betrieb!$A$7)*30)","v":{"$error":"#DIV/0!"}},null,null,null,"(Datenerfassung)"]
[7,"Lagerkapazität Festmist, f. Gärreste - Lagerraum m³ (Z. 5) /Anfall m³/Tag (Z. 6)","Tage",{"$f":"D8/D9","v":{"$error":"#DIV/0!"}}]
[8,"Lagerkapazitätsberechnung für Flüssigmist und flüssige Gärreste","--",null,null,"entsprechend den Hinweisen des  "]
[9,"Lagerraum (Bruttorauminhalt)","m³",{"$f":"Betrieb!$L$58-Betrieb!$Q$51","v":0},null,"Sächsischen Staatsministeriums für Umwelt und Landwirtschaft"]
[10,"    - Freibord und ggf. Restfüllstand zu Zeile 9","m³",{"$f":"(Betrieb!$L$58-Betrieb!$Q$51)-(Betrieb!$M$58-Betrieb!$Q$49)","v":0},null,"zur Ermittlung des Fassungsvermögens von Anlagen zur Lagerung"]
[11,"   + anrechenbare Staukanäle ","m³",{"$f":"Betrieb!$Q$49","v":0},null,"von Wirtschaftsdüngern und Gärresten in Umsetzung von"]
[12," = verfügbarer Lagerraum Flüssigmiste","m³",{"$f":"D12-D13+D14","v":0},null,"§ 12 der Düngeverordnung (DüV) vom 01.08.2017"]
[13,"Summe Anfall Flüssigmist (Gülle,Jauche) pro Tag","m³/Tag",{"$f":"Betrieb!$Q$53","v":0}]
[14," + Anfall Melkhausabwasser pro Tag (0,0085 m³ / Kuhplatz * Tag bzw. 0,0015 m³ / Milchschaf- / Milchziegenplatz * Tag)","m³/Tag",{"$f":"(Lager_Ri!$G$10+Lager_Schaf!$F$32)/((Betrieb!$A$41+5)*30)","v":0},null,"Anlagen:"]
[15,"Einträge (Niederschlags- bzw. Oberflächenwasser, Abwasser, Silosickersaft, Gärreste):","--",null,null,null,null,null,"Datenerfassungsblätter"]
[16," + auf alle Oberflächen nicht wasserdicht abgedeckter Läger (Festmist, Gülle, Jauche)","m³/Tag",{"$f":"(Betrieb!$J$20+Betrieb!$V$58)/((Betrieb!$A$41+5)*30)","v":0}]
[17," + auf die Hälfte der Oberfläche Siloanlage (wenn eingeleitet wird)","m³/Tag",{"$f":"Betrieb!$U$27/((Betrieb!$A$41+5)*30)","v":0}]
[18," + auf alle sonstige befestigten Flächen (wenn eingeleitet wird)","m³/Tag",{"$f":"Betrieb!$U$24/((Betrieb!$A$41+5)*30)","v":0}]
[19," + sonstige Abwässer","m³/Tag",0]
[20," + eingeleitete Gärrückstände","m³/Tag",{"$f":"Betrieb!$J$39/((Betrieb!$A$41+5)*30)","v":0}]
[21," - Minderanfall (laut gesondertem Nachweis)","m³/Tag",0]
[22," + Anfall Silosickersaft (wenn eingeleitet wird)","m³/Tag",{"$f":"Betrieb!$U$29/((Betrieb!$A$41+5)*30)","v":0}]
[23," = Summe Anfall Flüssigmist pro Tag","m³/Tag",{"$f":"16:16+17:17+19:19+20:20+21:21+22:22+23:23+24:24+25:25","v":0}]
[24,"Lagerraumbedarf für 180 Tage (Zeile 23 * 180)","m³",{"$f":"$D$26*180","v":0}]
[25,"Lagerkapazität ((Lagerraum m³, Zeile12 – Anfall Silosickersaft m³, Zeile 22) / Summe Anfall Wirtschaftsdünger m³/ Tag, Zeile 2)","Tage",{"$f":"($D$15/$D$26)","v":{"$error":"#DIV/0!"}},null,"Ort/Datum                         ",null,null,null,null," Unterschrift Bearbeiter Stempel  LfULG  "]
[26,"fehlender Lagerraum","  %",{"$f":"100-$D$15*100/$D$27","v":{"$error":"#DIV/0!"}}]

{"sheet":"WD-Anfall","index":10,"n_rows":111,"n_cols":9,"rows_kept":111,"cut":false,"hidden":false,"merged":[[21,0,21,7],[26,0,26,7],[46,1,46,3],[2,0,3,0],[2,1,3,3],[2,4,3,4],[2,5,2,6],[2,7,3,7],[3,5,3,6],[6,0,6,7],[9,0,9,7],[13,0,13,7],[102,0,102,6],[49,0,49,6],[57,0,57,6],[61,0,61,6],[70,1,70,6],[82,0,82,6]]}
["Richtwerte für den monatlichen Wirtschaftsdüngeranfall im Stall pro Tier "]
["(Oberflächenwasser- und Silosickersafteinleitungen in die Gülle- und/oder Jauchelager sind extra zu erfassen)"]
["Tierart","Flachlauf-, Tretmist 1)- und Anbindestall mit Einstreu",null,null,"Tiefstreustall, ohne separaten Fressbereich","Tiefstreustall,",null,"Laufstall, Anbindestall"]
[null,null,null,null,null,"mit separatem Fressbereich"]
["Rinder","Frischmist","Stallmist","Jauche","Stallmist","Stallmist","Gülle","Gülle"]
[null,"[t/Tier]","[m³/Tier]","[m³/Tier]","[m³/Tier]","[m³/Tier]","[m³/Tier]","[m³/Tier]"]
["Zuchtkälber"]
["Kälber bis 3 Monate (ohne Mastkälber)",0.26,0.31,0.03,0.23,0.1,0.12,0.21]
["Kälber über 3 bis 6 Monate (ohne Mastkälber)",0.34,0.41,0.05,0.31,0.14000000000000001,0.19,0.35]
["Jungrinder"]
["Jungrinder über 6 Monate bis 1 Jahr",0.52,0.63,0.13,0.47,0.21,0.31,0.56000000000000005]
["Jungrinder/Färsen über 1 Jahr bis 2 Jahre",0.85,1.02,0.27,0.77,0.35,0.55000000000000004,1]
["Färsen über 2 Jahre",1.03,1.24,0.38,0.96,0.43,0.73,1.32]
["Mastrinder"]
["Mastkälber bis 3 Monate2)",0.22,0.27,7.0000000000000007E-2,0.2,0.09,0.22,0.4]
["Mastkälber über 3 bis 6 Monate2)",0.23,0.28000000000000003,0.11,0.22,0.1,0.27,0.5]
["Mastrinder über 6 Monate bis 1 Jahr",0.38,0.46,0.24,0.4,0.18,0.35,0.63]
["Mastrinder über 1 Jahr bis 2 Jahre",0.5,0.6,0.42,0.52,0.23,0.41,0.74]
["Mastrinder über 2 Jahre (einschl. Zuchtbullen)",0.64,0.77,0.45,0.67,0.3,0.55000000000000004,1]
["Rosa-Kalbfleisch-Erzeugung 50- 350 kg LM",0.3,0.36,0.04,0.27,0.12,0.18,0.33]
["Fresseraufzucht",0.38,0.46,0.04,0.35,0.16,0.25,0.46]
["Mutterkühe"]
["Mutter- und Ammenkühe 500 kg incl. 0,9 Kalb ",1,1.2,0.46,1,0.45,0.73,1.33]
["Mutter- und Ammenkühe 700 kg incl. 0,9 Kalb",1.32,1.59,0.5,1.35,0.6,0.92,1.67]
["Mutter- und Ammenkühe 500 kg ohne Kalb",0.73,0.88,0.42,0.74,0.33,0.62,1.1299999999999999]
["Mutter- und Ammenkühe 700 kg ohne Kalb",1.05,1.27,0.46,1.1000000000000001,0.5,0.8,1.46]
["Milchkühe 3)"]
["Milchkuh   5 000 kg (leichte Rassen)",1.1499999999999999,1.39,0.49,1.18,0.53,0.85,1.54]
["Milchkuh   6 000 kg",1.2,1.45,0.5,1.19,0.54,0.87,1.58]
["Milchkuh   7 000 kg (leichte Rassen)",1.23,1.48,0.52,1.2,0.54,0.89,1.62]
["Milchkuh   8 000 kg",1.25,1.51,0.53,1.21,0.54,0.92,1.67]
["Milchkuh   9 000 kg (leichte Rassen)",1.32,1.59,0.55000000000000004,1.22,0.55000000000000004,0.94,1.71]
["Milchkuh 10 000 kg",1.33,1.6,0.56999999999999995,1.23,0.55000000000000004,0.96,1.75]
["Milchkuh 12 000 kg",1.42,1.71,0.6,1.25,0.56000000000000005,1.01,1.83]
["Melkhausabwasser4)",null,null,null,null,null,null,0.255]
["1 )Bei Tretmist ist der Jaucheanfall zu halbieren"]
["2) ohne Melkhausabwasser"]
["3) bei Milchkühen ergeben sich die Anfallswerte flüssiger Wirtschaftsdünger zuzüglich 0,255 m³"]
["4) Melkhausabwasser pro Tier und Monat"]
[]
["Rindermist:","22 - 25 % TS ",null,"Rinderjauche:",null,"3 % TS"]
["Rindergülle:","11 - 12 % TS",null,"Melkhausabwasser:",null,"1 % TS,"]
[]
[null,"    "]
[]
["Fortsetzung der Tabelle 1:"]
["Tierart","Flachstreu",null,null,"Tiefstreu","ohne Einstreu","Reinigungs-wasser"]
[null,"Frischmist","Frischmist","Jauche1)","Stallmist","Gülle1)"]
[null,"[t/Tier]","[m³/Tier]","[m³/Tier]","[m³/Tier]","[m³/Tier]","[m³/Tier]"]
["Schafe und Ziegen"]
["Schafe unter 1 Jahr und Hammel",7.3999999999999996E-2,0.114,null,0.08]
["Mutterschafe",9.1999999999999998E-2,0.14199999999999999,null,0.1]
["Mastlämmer",4.5999999999999999E-2,7.0999999999999994E-2,null,0.05]
["Weibliche Schafe über 1 Jahr (Zutreter)",8.3000000000000004E-2,0.128,null,0.09]
["Andere Schafe über 1 Jahr (Böcke)",0.11,0.16900000000000001,null,0.12]
["Mutterziegen",8.3000000000000004E-2,0.128,null,0.09]
["Andere Ziegen (unter 1 Jahr)",5.5E-2,8.5000000000000006E-2,null,0.06]
["Pferde"]
["Pferde unter 6 Monate, Aufzuchtponys bis 3 Jahre",0.28299999999999997,0.47,null,0.35]
["Pferde über 6 Monate bis 3 Jahre, Kleinpferde, Ponys",0.56599999999999995,0.94,null,0.7]
["Reit- und Zuchtpferde über 3 Jahre",0.93300000000000005,1.6,null,1.1000000000000001]
["Schweine"]
["Zuchtsauen ab 1. Belegung, güst u. tragend",0.24,0.27,0.08,0.2,0.26,0.02]
["Zuchtsauen laktierend",0.49,0.54,0.18,0.4,0.45,0.08]
["Ferkel 8 bis 28 kg",3.1E-2,3.4000000000000002E-2,1.7000000000000001E-2,0.03,4.2000000000000003E-2,8.0000000000000002E-3]
["Jungsauenaufzucht 28 -95 kg",0.115,0.13,0.04,0.13,0.14000000000000001,0.01]
["Jungsaueneingliederung 95-135 kg",0.155,0.17,0.06,0.15,0.19,0.02]
["Eberhaltung ab 50 kg",0.15,0.17,0.105,0.3,0.28000000000000003,0.02]
["Mastschweine 28 bis 115 kg Trockenfütterung ",0.09,0.1,4.2000000000000003E-2,0.12,0.125,8.0000000000000002E-3]
["Mastschweine 28 bis 115 kg Flüssigfütterung",0.09,0.1,5.1999999999999998E-2,0.12,0.155,8.0000000000000002E-3]
["Melkhausabwasser2)",4.4999999999999998E-2]
[]
[" 4) bei Milchschafen und -ziegen ergeben sich die Anfallswerte flüssiger Wirtschaftsdünger zuzüglich 0,045 m³"]
["Melkhausabwasser pro Tier und Monat"]
[]
["Schweinemist:","22 - 25 ","% TS,","Schweinegülle (Flüssigfütterung und Jungsauen)",null,null,"6    % TS"]
["Pferdemist:",25,"% TS,","Schweinegülle (Sauen und Ferkel)",null,null,"4    % TS","   "]
["Schafmist:",40,"% TS,","Schweinegülle (Trockenfütterung)",null,null,"7,5 % TS","   "]
[null,null,null,"Schweinejauche:",null,null,"3    % TS",null,"  "]
["Fortsetzung der Tabelle 1:"]
["Tierart","Frischmist","Frischmist","Tiefstreu 1)","Trockenkot 1),2)","Jauche 1),2)","Gülle1)"]
[null,"[t/100 Tiere]","m³/100 Tiere","[m³/100 Tiere]","[m³/100 Tiere]","[m³/100 Tiere]","[m³/100 Tiere]"]
["Geflügel"]
["Legehennen über 6 Monate",0.18329999999999999,{"$f":"B84/0.8","v":0.22912499999999997},0.25,0.25]
["Küken und Junghennen zur Aufzucht als Legehennen",5.8299999999999998E-2,{"$f":"B85/0.8","v":7.2874999999999995E-2},0.09,0.08]
["Masthähnchen (Broiler), Mast über 39 d",9.8400000000000001E-2,0.123,0.12]
["Masthähnchen (Broiler), Mast über 34 d",9.2499999999999999E-2,0.11562499999999999,0.12]
["Masthähnchen (Broiler), Mast 30-33 d",8.3299999999999999E-2,0.104125,0.1]
["Masthähnchen (Broiler), Mast bis 29 d",7.7499999999999999E-2,9.6874999999999989E-2,0.1]
["Enten zur Zucht",0.85,1.0625,0.8]
["Mastenten (Pekingenten)",0.48,0.6,0.6]
["Mastenten (Flugenten)",0.38300000000000001,0.47875000000000001,0.48]
["Gänse zur Zucht",0.95,1.1874999999999998,0.9]
["Mastgänse (Kurzmast, 5,0 kg)",0.13830000000000001,0.172875,0.13]
["Mastgänse (Mittelmast, 6,8 kg)",0.31169999999999998,0.38962499999999994,0.3]
["Mastgänse (Langmast, 7,8 kg)",0.51329999999999998,0.64162499999999989,0.48]
["Mastputen (Hennen) bis 17 Wochen",0.42,{"$f":"B97/0.5","v":0.84},0.63]
["Mastputen (Hähne) bis 21 Wochen",0.40329999999999999,{"$f":"B98/0.5","v":0.80659999999999998},0.6]
["Mastputen Hennen ab 6. Woche",0.5,1,0.75]
["Mastputen Hähne ab 6. Woche",0.50838000000000005,1.0167600000000001,0.76]
["Gemischtgeschlechtliche Mast, incl. Aufzucht",0.41199999999999998,0.82399999999999995,0.62]
["Putenaufzucht bis 5 Wochen, gemischtgeschlechtlich",0.11,0.22,0.22]
["Kaninchen"]
["Kaninchen (einschließlich Nachzucht, geschlossenes System)",10.130000000000001,10.96,8.2200000000000006,3.39,4.75,7.46]
["Mastkaninchen",0.93799999999999994,{"$f":"B105/0.9","v":1.0422222222222222},0.9,0.31,0.44,0.68799999999999994]
["Zuchtkaninchen mit Absetzer",2.3250000000000002,2.5833333333333335,2.1,0.77,1.08,1.7]
["1) ohne Reinigungsabwasser"]
["2) Lagerzeit auf den Kotbändern länger als 48 h und Kotbelüftung; bei Kaninchen: Kot-Harn-Trennung"]
[]
["Geflügelmist:","45 % TS,","Kaninchengülle:",null,"15 % TS,"]
["Geflügeltrockenkot:","60 % TS, ","Kaninchenjauche:",null,"  3 % TS"]